BDBM36348 (4-{9-(3-Chloro-phenyl)-2-[2-(3H-imidazol-4-yl)-ethylamino]-9H-purin-6-ylamino}-phenyl)-piperidin-1-yl-methanone, 16::CID24762178
SMILES: Clc1cccc(c1)-n1cnc2c(Nc3ccc(cc3)C(=O)N3CCCCC3)nc(NCCc3cnc[nH]3)nc12
InChI Key: InChIKey=BKFJGJPDTNSSAQ-UHFFFAOYSA-N
Data: 1 IC50  1 EC50
Activity Spreadsheet -- Enzyme Inhibition Constant Data from BindingDB
Found 2 hits for monomerid = 36348
Trg + Lig
Ki
nM
ΔG°
kcal/mole
IC50
nM
Kd
nM
EC50/IC50
nM
koff
s-1
kon
M-1s-1
pHTemp
°C
Calcium-dependent protein kinase 1
(Plasmodium Falciparum)
BDBM36348
((4-{9-(3-Chloro-phenyl)-2-[2-(3H-imidazol-4-yl)-et...)
Show SMILES Clc1cccc(c1)-n1cnc2c(Nc3ccc(cc3)C(=O)N3CCCCC3)nc(NCCc3cnc[nH]3)nc12
Show InChI InChI=1S/C28H28ClN9O/c29-20-5-4-6-23(15-20)38-18-33-24-25(35-28(36-26(24)38)31-12-11-22-16-30-17-32-22)34-21-9-7-19(8-10-21)27(39)37-13-2-1-3-14-37/h4-10,15-18H,1-3,11-14H2,(H,30,32)(H2,31,34,35,36)
n/an/an/an/a 352n/an/a7.524
The Scripps Research Institute
Nat Chem Biol 4: 347-56 (2008)
Article DOI: 10.1038/nchembio.87
BindingDB Entry DOI: 10.7270/Q2TB1573
Calcium-dependent protein kinase 1
(Plasmodium Falciparum)
BDBM36348
((4-{9-(3-Chloro-phenyl)-2-[2-(3H-imidazol-4-yl)-et...)
Show SMILES Clc1cccc(c1)-n1cnc2c(Nc3ccc(cc3)C(=O)N3CCCCC3)nc(NCCc3cnc[nH]3)nc12
Show InChI InChI=1S/C28H28ClN9O/c29-20-5-4-6-23(15-20)38-18-33-24-25(35-28(36-26(24)38)31-12-11-22-16-30-17-32-22)34-21-9-7-19(8-10-21)27(39)37-13-2-1-3-14-37/h4-10,15-18H,1-3,11-14H2,(H,30,32)(H2,31,34,35,36)
n/an/a 626n/an/an/an/a7.524
The Scripps Research Institute
Assay Description
The test compounds and enzyme were mixed in buffer, and the substrate and [gamma-33P] ATP/ATP were added to the mixture to initiate the reaction. Aft...
Nat Chem Biol 4: 347-56 (2008)
Article DOI: 10.1038/nchembio.87
BindingDB Entry DOI: 10.7270/Q2TB1573