null
SMILES: COc1ccc(Cn2c3CCNC(=O)c3c(c2-c2ccncc2)-c2ccc(F)cc2)cc1
InChI Key: InChIKey=HQPXKCMVHKFZGU-UHFFFAOYSA-N
Activity Spreadsheet -- Enzyme Inhibition Constant Data from BindingDB
Found 1 hit for monomerid = 392840
Trg + Lig
Ki
nM
ΔG°
kcal/mole
IC50
nM
Kd
nM
EC50/IC50
nM
koff
s-1
kon
M-1s-1
pHTemp
°C
Receptor-interacting serine/threonine-protein kinase 3
(Homo sapiens (Human))
BDBM392840
(US10301306, Example 38)
Show SMILES COc1ccc(Cn2c3CCNC(=O)c3c(c2-c2ccncc2)-c2ccc(F)cc2)cc1
Show InChI InChI=1S/C26H22FN3O2/c1-32-21-8-2-17(3-9-21)16-30-22-12-15-29-26(31)24(22)23(18-4-6-20(27)7-5-18)25(30)19-10-13-28-14-11-19/h2-11,13-14H,12,15-16H2,1H3,(H,29,31)
Reactome pathway
US Patent
n/an/a<30n/an/an/an/an/an/a
GSK
Assay Description
The assays were performed in black 1536-well plates. The final assay volume of 2 μl contained a mixture of a fluorescently labeled HTRF probe, T...
Bioorg Med Chem Lett 18: 5018-22 (2008)
BindingDB Entry DOI: 10.7270/Q2M90C19