BDBM39396 2-bromobenzoic acid (5-amino-1-besyl-pyrazol-3-yl) ester::2-bromobenzoic acid [5-amino-1-(benzenesulfonyl)-3-pyrazolyl] ester::5-amino-1-(phenylsulfonyl)-1H-pyrazol-3-yl 2-bromobenzoate::MLS000044151::SMR000021561::[5-amino-1-(benzenesulfonyl)pyrazol-3-yl] 2-bromobenzoate::[5-azanyl-1-(phenylsulfonyl)pyrazol-3-yl] 2-bromanylbenzoate::cid_3242592
SMILES: Nc1cc(OC(=O)c2ccccc2Br)nn1S(=O)(=O)c1ccccc1
InChI Key: InChIKey=OSJCPZAKZHSNDS-UHFFFAOYSA-N
Data: 1 IC50
Activity Spreadsheet -- Enzyme Inhibition Constant Data from BindingDB
Found 1 hit for monomerid = 39396
Trg + Lig
Ki
nM
ΔG°
kcal/mole
IC50
nM
Kd
nM
EC50/IC50
nM
koff
s-1
kon
M-1s-1
pHTemp
°C
Genome polyprotein
(West Nile virus)
BDBM39396
(2-bromobenzoic acid (5-amino-1-besyl-pyrazol-3-yl)...)
Show SMILES Nc1cc(OC(=O)c2ccccc2Br)nn1S(=O)(=O)c1ccccc1
Show InChI InChI=1S/C16H12BrN3O4S/c17-13-9-5-4-8-12(13)16(21)24-15-10-14(18)20(19-15)25(22,23)11-6-2-1-3-7-11/h1-10H,18H2
PCBioAssay
n/an/a 1.26E+3n/an/an/an/an/an/a
University of Pittsburgh Molecular Library Screening Center
Curated by PubChem BioAssay
Assay Description
The HTS assay to identify Inhibitors of West Nile Virus (WNV) NS2bNS3 Proteinase was proposed by Dr Alex Strongin of the Burnham Institute XO1-MH0776...
PubChem Bioassay (2007)
BindingDB Entry DOI: 10.7270/Q2222S6W