BDBM39867 4-methyl-N-(2-methyl-2-oxidanyl-propyl)benzamide::MLS000027455::N-(2-hydroxy-2-methyl-propyl)-4-methyl-benzamide::N-(2-hydroxy-2-methylpropyl)-4-methylbenzamide::SMR000035677::cid_659449
SMILES: Cc1ccc(cc1)C(=O)NCC(C)(C)O
InChI Key: InChIKey=QGWZZKFRTUKFPH-UHFFFAOYSA-N
Data: 1 IC50  1 EC50
Activity Spreadsheet -- Enzyme Inhibition Constant Data from BindingDB
Found 2 hits for monomerid = 39867
Trg + Lig
Ki
nM
ΔG°
kcal/mole
IC50
nM
Kd
nM
EC50/IC50
nM
koff
s-1
kon
M-1s-1
pHTemp
°C
Integrin alpha-4
(Homo sapiens (Human))
BDBM39867
(4-methyl-N-(2-methyl-2-oxidanyl-propyl)benzamide |...)
Show SMILES Cc1ccc(cc1)C(=O)NCC(C)(C)O
Show InChI InChI=1S/C12H17NO2/c1-9-4-6-10(7-5-9)11(14)13-8-12(2,3)15/h4-7,15H,8H2,1-3H3,(H,13,14)
PCBioAssay
n/an/an/an/a 2.34E+3n/an/an/an/a
NMMLSC
Curated by PubChem BioAssay
Assay Description
Assay Support: 1 X01 MH077638-01 MLSCN Assay for Allosteric Ligands for the VLA-4 Integrin PI: SKLAR, LARRY A University of New Mexico Assay Overview...
PubChem Bioassay (2007)
BindingDB Entry DOI: 10.7270/Q2H130FK
tyrosine 3-monooxygenase/tryptophan 5-monooxygenase activation protein, gamma polypeptide
(Homo sapiens (Human))
BDBM39867
(4-methyl-N-(2-methyl-2-oxidanyl-propyl)benzamide |...)
Show SMILES Cc1ccc(cc1)C(=O)NCC(C)(C)O
Show InChI InChI=1S/C12H17NO2/c1-9-4-6-10(7-5-9)11(14)13-8-12(2,3)15/h4-7,15H,8H2,1-3H3,(H,13,14)
Reactome pathway
PCBioAssay
n/an/a>5.00E+4n/an/an/an/an/an/a
Emory University Molecular Libraries Screening Center
Curated by PubChem BioAssay
Assay Description
NIH Molecular Libraries Screening Centers Network [MLSCN] Emory Chemical Biology Discovery Center in MLSCN MLSCN Grant: 1 X01MH78953-01 The 14-3-3 pr...
PubChem Bioassay (2007)
BindingDB Entry DOI: 10.7270/Q2V986FT