null
SMILES: CCOC(=O)c1cc2C(=O)c3ccccc3-n2c1N
InChI Key: InChIKey=NLOFNKPOURZRLR-UHFFFAOYSA-N
Activity Spreadsheet -- Enzyme Inhibition Constant Data from BindingDB
Found 5 hits for monomerid = 41787
Trg + Lig
Ki
nM
ΔG°
kcal/mole
IC50
nM
Kd
nM
EC50/IC50
nM
koff
s-1
kon
M-1s-1
pHTemp
°C
Serine/threonine-protein kinase PLK1
(Homo sapiens (Human))
BDBM41787
(1-amino-4-keto-pyrrol[1,2-a]indole-2-carboxylic ac...)
Show SMILES CCOC(=O)c1cc2C(=O)c3ccccc3-n2c1N
Show InChI InChI=1S/C14H12N2O3/c1-2-19-14(18)9-7-11-12(17)8-5-3-4-6-10(8)16(11)13(9)15/h3-7H,2,15H2,1H3
NCI pathway
Reactome pathway
PCBioAssay
n/an/an/an/a>5.00E+4n/an/an/an/a
University of Pittsburgh Molecular Library Screening Center
Curated by PubChem BioAssay
Assay Description
List of compounds to be tested: Compounds that met the active criterion of Z-score is
PubChem Bioassay (2007)
BindingDB Entry DOI: 10.7270/Q2Z036KJ
Serine/threonine-protein kinase PLK1
(Homo sapiens (Human))
BDBM41787
(1-amino-4-keto-pyrrol[1,2-a]indole-2-carboxylic ac...)
Show SMILES CCOC(=O)c1cc2C(=O)c3ccccc3-n2c1N
Show InChI InChI=1S/C14H12N2O3/c1-2-19-14(18)9-7-11-12(17)8-5-3-4-6-10(8)16(11)13(9)15/h3-7H,2,15H2,1H3
NCI pathway
Reactome pathway
PCBioAssay
n/an/a 1.99E+4n/an/an/an/an/an/a
University of Pittsburgh Molecular Library Screening Center
Curated by PubChem BioAssay
Assay Description
List of compounds to be tested: Compounds that met the active criterion of Z-score is
PubChem Bioassay (2007)
BindingDB Entry DOI: 10.7270/Q2T72FVT
Tropomyosin alpha-1 chain
(Sus scrofa)
BDBM41787
(1-amino-4-keto-pyrrol[1,2-a]indole-2-carboxylic ac...)
Show SMILES CCOC(=O)c1cc2C(=O)c3ccccc3-n2c1N
Show InChI InChI=1S/C14H12N2O3/c1-2-19-14(18)9-7-11-12(17)8-5-3-4-6-10(8)16(11)13(9)15/h3-7H,2,15H2,1H3
PCBioAssay
n/an/an/an/a 2.44E+4n/an/an/an/a
The Scripps Research Institute Molecular Screening Center
Curated by PubChem BioAssay
Assay Description
Source (MLPCN Center Name): The Scripps Research Institute Molecular Screening Center (SRIMSC) Affiliation: The Scripps Research Institute, TSRI Assa...
PubChem Bioassay (2011)
BindingDB Entry DOI: 10.7270/Q21N7ZKB
Glycoprotein 42
(Human herpesvirus 4 type 2)
BDBM41787
(1-amino-4-keto-pyrrol[1,2-a]indole-2-carboxylic ac...)
Show SMILES CCOC(=O)c1cc2C(=O)c3ccccc3-n2c1N
Show InChI InChI=1S/C14H12N2O3/c1-2-19-14(18)9-7-11-12(17)8-5-3-4-6-10(8)16(11)13(9)15/h3-7H,2,15H2,1H3
PCBioAssay
n/an/a 2.27E+3n/an/an/an/an/an/a
Emory University Molecular Libraries Screening Center
Curated by PubChem BioAssay
Assay Description
NIH Molecular Libraries Screening Centers Network [MLSCN] Emory Chemical Biology Discovery Center in MLSCN Assay provider: Theodore Jardetzky; Northw...
PubChem Bioassay (2008)
BindingDB Entry DOI: 10.7270/Q2057DCW
Serine/threonine-protein kinase PLK1
(Homo sapiens (Human))
BDBM41787
(1-amino-4-keto-pyrrol[1,2-a]indole-2-carboxylic ac...)
Show SMILES CCOC(=O)c1cc2C(=O)c3ccccc3-n2c1N
Show InChI InChI=1S/C14H12N2O3/c1-2-19-14(18)9-7-11-12(17)8-5-3-4-6-10(8)16(11)13(9)15/h3-7H,2,15H2,1H3
NCI pathway
Reactome pathway
PCBioAssay
n/an/an/an/a>5.00E+4n/an/an/an/a
University of Pittsburgh Molecular Library Screening Center
Curated by PubChem BioAssay
Assay Description
List of compounds to be tested: Compounds that met the active criterion of Z-score is
PubChem Bioassay (2007)
BindingDB Entry DOI: 10.7270/Q2N58JS6