null
SMILES: COc1cc(C)[nH]c(=O)c1CN1CCc2c(C)cc(C(C)C3COC3)c(Cl)c2C1=O
InChI Key:
Activity Spreadsheet -- Enzyme Inhibition Constant Data from BindingDB
Found 4 hits for monomerid = 435691
Trg + Lig
Ki
nM
ΔG°
kcal/mole
IC50
nM
Kd
nM
EC50/IC50
nM
koff
s-1
kon
M-1s-1
pHTemp
°C
Histone-lysine N-methyltransferase EZH2
(Homo sapiens (Human))
BDBM435691
(US10570121, Example 197 | US10570121, Example 198)
Show SMILES COc1cc(C)[nH]c(=O)c1CN1CCc2c(C)cc(C(C)C3COC3)c(Cl)c2C1=O
US Patent
0.0100n/an/an/an/an/an/an/an/a
Pfizer Inc.
US Patent
Assay Description
A. Compound preparation1. Prepare 10 mM stock solutions in 100% DMSO from solid material2. Serial dilute 10 mM compound stocks either 2 or 3-fold in ...
US Patent US10570121 (2020)
BindingDB Entry DOI: 10.7270/Q28W3GQD
Histone-lysine N-methyltransferase EZH2
(Homo sapiens (Human))
BDBM435691
(US10570121, Example 197 | US10570121, Example 198)
Show SMILES COc1cc(C)[nH]c(=O)c1CN1CCc2c(C)cc(C(C)C3COC3)c(Cl)c2C1=O
US Patent
33n/an/an/an/an/an/an/an/a
Pfizer Inc.
US Patent
Assay Description
A. Compound preparation1. Prepare 10 mM stock solutions in 100% DMSO from solid material2. Serial dilute 10 mM compound stocks either 2 or 3-fold in ...
US Patent US10570121 (2020)
BindingDB Entry DOI: 10.7270/Q28W3GQD
Histone-lysine N-methyltransferase EZH2 [2-746,Y641N]
(Homo sapiens (Human))
BDBM435691
(US10570121, Example 197 | US10570121, Example 198)
Show SMILES COc1cc(C)[nH]c(=O)c1CN1CCc2c(C)cc(C(C)C3COC3)c(Cl)c2C1=O
NCI pathway
Reactome pathway
US Patent
n/an/a 1n/an/an/an/an/an/a
Pfizer Inc.
US Patent
Assay Description
A. Compound preparation1. Prepare 10 mM stock solutions in 100% DMSO from solid material2. Serial dilute 10 mM compound stocks either 2 or 3-fold in ...
US Patent US10570121 (2020)
BindingDB Entry DOI: 10.7270/Q28W3GQD
Histone-lysine N-methyltransferase EZH2 [2-746,Y641N]
(Homo sapiens (Human))
BDBM435691
(US10570121, Example 197 | US10570121, Example 198)
Show SMILES COc1cc(C)[nH]c(=O)c1CN1CCc2c(C)cc(C(C)C3COC3)c(Cl)c2C1=O
NCI pathway
Reactome pathway
US Patent
n/an/a 62n/an/an/an/an/an/a
Pfizer Inc.
US Patent
Assay Description
A. Compound preparation1. Prepare 10 mM stock solutions in 100% DMSO from solid material2. Serial dilute 10 mM compound stocks either 2 or 3-fold in ...
US Patent US10570121 (2020)
BindingDB Entry DOI: 10.7270/Q28W3GQD