null
SMILES: Cc1nnn(C)c1-c1cc2n([C@@H](C3CCOCC3)c3ccccc3)c3cc(cnc3c2cc1F)C(C)(C)O
InChI Key: InChIKey=AIWLOFZSVQLGOB-GDLZYMKVSA-N
PDB links: 1 PDB ID matches this monomer.
Activity Spreadsheet -- Enzyme Inhibition Constant Data from BindingDB
Found 5 hits for monomerid = 445527
Trg + Lig
Ki
nM
ΔG°
kcal/mole
IC50
nM
Kd
nM
EC50/IC50
nM
koff
s-1
kon
M-1s-1
pHTemp
°C
Bromodomain-containing protein 4 [1-477]
(Homo sapiens (Human))
BDBM445527
(2-[7-(Dimethyl-1H-1,2,3-triazol-5-yl)-8-fluoro-5-[...)
Show SMILES Cc1nnn(C)c1-c1cc2n([C@@H](C3CCOCC3)c3ccccc3)c3cc(cnc3c2cc1F)C(C)(C)O |r,wU:11.11,(5.87,4.1,;5.87,2.56,;7.24,1.86,;7,.34,;5.48,.1,;4.71,-1.23,;4.78,1.47,;3.3,1.87,;2.27,.73,;.76,1.05,;-.49,.14,;-.49,-1.4,;.85,-2.17,;2.18,-1.4,;3.51,-2.17,;3.51,-3.71,;2.18,-4.48,;.85,-3.71,;-1.82,-2.17,;-3.15,-1.4,;-4.49,-2.17,;-4.49,-3.71,;-3.15,-4.48,;-1.82,-3.71,;-1.73,1.05,;-3.24,.73,;-4.27,1.87,;-3.79,3.33,;-2.29,3.65,;-1.26,2.51,;.28,2.51,;1.31,3.65,;2.82,3.33,;3.85,4.48,;-5.76,1.47,;-6.85,2.56,;-6.16,-.02,;-7.24,1.07,)|
Show InChI InChI=1S/C30H32FN5O2/c1-18-28(35(4)34-33-18)22-16-25-23(15-24(22)31)27-26(14-21(17-32-27)30(2,3)37)36(25)29(19-8-6-5-7-9-19)20-10-12-38-13-11-20/h5-9,14-17,20,29,37H,10-13H2,1-4H3/t29-/m1/s1
US Patent
n/an/a<1.50E+3n/an/an/an/an/an/a
Bristol-Myers Squibb Company
US Patent
Assay Description
All assay components were dissolved in buffer composition 20 mM Hepes pH 7.5, 150 mM NaCl, 5 mM DTT, 0.005% Tween 20, and 100 ug/ml BSA for BRD4 (1-4...
US Patent US10683290 (2020)
BindingDB Entry DOI: 10.7270/Q25D8VWB
Myc proto-oncogene protein
(Homo sapiens (Human))
BDBM445527
(2-[7-(Dimethyl-1H-1,2,3-triazol-5-yl)-8-fluoro-5-[...)
Show SMILES Cc1nnn(C)c1-c1cc2n([C@@H](C3CCOCC3)c3ccccc3)c3cc(cnc3c2cc1F)C(C)(C)O |r,wU:11.11,(5.87,4.1,;5.87,2.56,;7.24,1.86,;7,.34,;5.48,.1,;4.71,-1.23,;4.78,1.47,;3.3,1.87,;2.27,.73,;.76,1.05,;-.49,.14,;-.49,-1.4,;.85,-2.17,;2.18,-1.4,;3.51,-2.17,;3.51,-3.71,;2.18,-4.48,;.85,-3.71,;-1.82,-2.17,;-3.15,-1.4,;-4.49,-2.17,;-4.49,-3.71,;-3.15,-4.48,;-1.82,-3.71,;-1.73,1.05,;-3.24,.73,;-4.27,1.87,;-3.79,3.33,;-2.29,3.65,;-1.26,2.51,;.28,2.51,;1.31,3.65,;2.82,3.33,;3.85,4.48,;-5.76,1.47,;-6.85,2.56,;-6.16,-.02,;-7.24,1.07,)|
Show InChI InChI=1S/C30H32FN5O2/c1-18-28(35(4)34-33-18)22-16-25-23(15-24(22)31)27-26(14-21(17-32-27)30(2,3)37)36(25)29(19-8-6-5-7-9-19)20-10-12-38-13-11-20/h5-9,14-17,20,29,37H,10-13H2,1-4H3/t29-/m1/s1
Reactome pathway
n/an/a 0.800n/an/an/an/an/an/a
TBA
Assay Description
Inhibition of c-MYC (unknown origin)
Citation and Details
Article DOI: 10.1016/j.bmcl.2021.128376
BindingDB Entry DOI: 10.7270/Q2KS6WD7
Bromodomain-containing protein 4
(Homo sapiens (Human))
BDBM445527
(2-[7-(Dimethyl-1H-1,2,3-triazol-5-yl)-8-fluoro-5-[...)
Show SMILES Cc1nnn(C)c1-c1cc2n([C@@H](C3CCOCC3)c3ccccc3)c3cc(cnc3c2cc1F)C(C)(C)O |r,wU:11.11,(5.87,4.1,;5.87,2.56,;7.24,1.86,;7,.34,;5.48,.1,;4.71,-1.23,;4.78,1.47,;3.3,1.87,;2.27,.73,;.76,1.05,;-.49,.14,;-.49,-1.4,;.85,-2.17,;2.18,-1.4,;3.51,-2.17,;3.51,-3.71,;2.18,-4.48,;.85,-3.71,;-1.82,-2.17,;-3.15,-1.4,;-4.49,-2.17,;-4.49,-3.71,;-3.15,-4.48,;-1.82,-3.71,;-1.73,1.05,;-3.24,.73,;-4.27,1.87,;-3.79,3.33,;-2.29,3.65,;-1.26,2.51,;.28,2.51,;1.31,3.65,;2.82,3.33,;3.85,4.48,;-5.76,1.47,;-6.85,2.56,;-6.16,-.02,;-7.24,1.07,)|
Show InChI InChI=1S/C30H32FN5O2/c1-18-28(35(4)34-33-18)22-16-25-23(15-24(22)31)27-26(14-21(17-32-27)30(2,3)37)36(25)29(19-8-6-5-7-9-19)20-10-12-38-13-11-20/h5-9,14-17,20,29,37H,10-13H2,1-4H3/t29-/m1/s1
n/an/a 0.400n/an/an/an/an/an/a
TBA
Assay Description
Inhibition of BRD4 (unknown origin)
Citation and Details
Article DOI: 10.1016/j.bmcl.2021.128376
BindingDB Entry DOI: 10.7270/Q2KS6WD7
Bromodomain-containing protein 4
(Homo sapiens (Human))
BDBM445527
(2-[7-(Dimethyl-1H-1,2,3-triazol-5-yl)-8-fluoro-5-[...)
Show SMILES Cc1nnn(C)c1-c1cc2n([C@@H](C3CCOCC3)c3ccccc3)c3cc(cnc3c2cc1F)C(C)(C)O |r,wU:11.11,(5.87,4.1,;5.87,2.56,;7.24,1.86,;7,.34,;5.48,.1,;4.71,-1.23,;4.78,1.47,;3.3,1.87,;2.27,.73,;.76,1.05,;-.49,.14,;-.49,-1.4,;.85,-2.17,;2.18,-1.4,;3.51,-2.17,;3.51,-3.71,;2.18,-4.48,;.85,-3.71,;-1.82,-2.17,;-3.15,-1.4,;-4.49,-2.17,;-4.49,-3.71,;-3.15,-4.48,;-1.82,-3.71,;-1.73,1.05,;-3.24,.73,;-4.27,1.87,;-3.79,3.33,;-2.29,3.65,;-1.26,2.51,;.28,2.51,;1.31,3.65,;2.82,3.33,;3.85,4.48,;-5.76,1.47,;-6.85,2.56,;-6.16,-.02,;-7.24,1.07,)|
Show InChI InChI=1S/C30H32FN5O2/c1-18-28(35(4)34-33-18)22-16-25-23(15-24(22)31)27-26(14-21(17-32-27)30(2,3)37)36(25)29(19-8-6-5-7-9-19)20-10-12-38-13-11-20/h5-9,14-17,20,29,37H,10-13H2,1-4H3/t29-/m1/s1
n/an/a 1.30n/an/an/an/an/an/a
TBA
Assay Description
Inhibition of BRD4 (unknown origin)
Citation and Details
Article DOI: 10.1016/j.bmcl.2021.128376
BindingDB Entry DOI: 10.7270/Q2KS6WD7
Myc proto-oncogene protein
(Homo sapiens (Human))
BDBM445527
(2-[7-(Dimethyl-1H-1,2,3-triazol-5-yl)-8-fluoro-5-[...)
Show SMILES Cc1nnn(C)c1-c1cc2n([C@@H](C3CCOCC3)c3ccccc3)c3cc(cnc3c2cc1F)C(C)(C)O |r,wU:11.11,(5.87,4.1,;5.87,2.56,;7.24,1.86,;7,.34,;5.48,.1,;4.71,-1.23,;4.78,1.47,;3.3,1.87,;2.27,.73,;.76,1.05,;-.49,.14,;-.49,-1.4,;.85,-2.17,;2.18,-1.4,;3.51,-2.17,;3.51,-3.71,;2.18,-4.48,;.85,-3.71,;-1.82,-2.17,;-3.15,-1.4,;-4.49,-2.17,;-4.49,-3.71,;-3.15,-4.48,;-1.82,-3.71,;-1.73,1.05,;-3.24,.73,;-4.27,1.87,;-3.79,3.33,;-2.29,3.65,;-1.26,2.51,;.28,2.51,;1.31,3.65,;2.82,3.33,;3.85,4.48,;-5.76,1.47,;-6.85,2.56,;-6.16,-.02,;-7.24,1.07,)|
Show InChI InChI=1S/C30H32FN5O2/c1-18-28(35(4)34-33-18)22-16-25-23(15-24(22)31)27-26(14-21(17-32-27)30(2,3)37)36(25)29(19-8-6-5-7-9-19)20-10-12-38-13-11-20/h5-9,14-17,20,29,37H,10-13H2,1-4H3/t29-/m1/s1
Reactome pathway
n/an/a 1n/an/an/an/an/an/a
TBA
Assay Description
Inhibition of c-MYC (unknown origin)
Citation and Details
Article DOI: 10.1016/j.bmcl.2021.128376
BindingDB Entry DOI: 10.7270/Q2KS6WD7