BDBM4570 4-anilinoquinazoline deriv. 10c::N-{4-[(3-bromophenyl)amino]quinazolin-6-yl}-4-(dipropylamino)but-2-ynamide
SMILES: CCCN(CCC)CC#CC(=O)Nc1ccc2ncnc(Nc3cccc(Br)c3)c2c1
InChI Key: InChIKey=HYIYITLSLFGRPG-UHFFFAOYSA-N
Data: 2 IC50
Activity Spreadsheet -- Enzyme Inhibition Constant Data from BindingDB
Found 2 hits for monomerid = 4570
Trg + Lig
Ki
nM
ΔG°
kcal/mole
IC50
nM
Kd
nM
EC50/IC50
nM
koff
s-1
kon
M-1s-1
pHTemp
°C
Receptor tyrosine-protein kinase erbB-2
(Homo sapiens (Human))
BDBM4570
(4-anilinoquinazoline deriv. 10c | N-{4-[(3-bromoph...)
Show SMILES CCCN(CCC)CC#CC(=O)Nc1ccc2ncnc(Nc3cccc(Br)c3)c2c1
Show InChI InChI=1S/C24H26BrN5O/c1-3-12-30(13-4-2)14-6-9-23(31)28-20-10-11-22-21(16-20)24(27-17-26-22)29-19-8-5-7-18(25)15-19/h5,7-8,10-11,15-17H,3-4,12-14H2,1-2H3,(H,28,31)(H,26,27,29)
n/an/a 177n/an/an/an/an/an/a
Wyeth-Ayerst Research
Assay Description
The HER-2 kinase autophosphorylation activity was measured by DELFIA/time-resolved fluorometry with excitation at 340 nm and emission at 615 nm. Po...
J Med Chem 44: 2719-34 (2001)
Article DOI: 10.1021/jm0005555
BindingDB Entry DOI: 10.7270/Q2PN93TS
Epidermal growth factor receptor
(Homo sapiens (Human))
BDBM4570
(4-anilinoquinazoline deriv. 10c | N-{4-[(3-bromoph...)
Show SMILES CCCN(CCC)CC#CC(=O)Nc1ccc2ncnc(Nc3cccc(Br)c3)c2c1
Show InChI InChI=1S/C24H26BrN5O/c1-3-12-30(13-4-2)14-6-9-23(31)28-20-10-11-22-21(16-20)24(27-17-26-22)29-19-8-5-7-18(25)15-19/h5,7-8,10-11,15-17H,3-4,12-14H2,1-2H3,(H,28,31)(H,26,27,29)
n/an/a 62n/an/an/an/a7.422
Wyeth-Ayerst Research
Assay Description
The EGF-R kinase autophosphorylation activity was measured by DELFIA/time-resolved fluorometry with excitation at 340 nm and emission at 615 nm. Po...
J Med Chem 44: 2719-34 (2001)
Article DOI: 10.1021/jm0005555
BindingDB Entry DOI: 10.7270/Q2PN93TS