BDBM4575 4-anilinoquinazoline deriv. 10h::N-{4-[(3-bromophenyl)amino]quinazolin-6-yl}-4-(morpholin-4-yl)but-2-ynamide
SMILES: Brc1cccc(Nc2ncnc3ccc(NC(=O)C#CCN4CCOCC4)cc23)c1
InChI Key: InChIKey=GGHZBUPPNLNXED-UHFFFAOYSA-N
Data: 2 IC50
Activity Spreadsheet -- Enzyme Inhibition Constant Data from BindingDB
Found 2 hits for monomerid = 4575
Trg + Lig
Ki
nM
ΔG°
kcal/mole
IC50
nM
Kd
nM
EC50/IC50
nM
koff
s-1
kon
M-1s-1
pHTemp
°C
Receptor tyrosine-protein kinase erbB-2
(Homo sapiens (Human))
BDBM4575
(4-anilinoquinazoline deriv. 10h | N-{4-[(3-bromoph...)
Show SMILES Brc1cccc(Nc2ncnc3ccc(NC(=O)C#CCN4CCOCC4)cc23)c1
Show InChI InChI=1S/C22H20BrN5O2/c23-16-3-1-4-17(13-16)27-22-19-14-18(6-7-20(19)24-15-25-22)26-21(29)5-2-8-28-9-11-30-12-10-28/h1,3-4,6-7,13-15H,8-12H2,(H,26,29)(H,24,25,27)
n/an/a 53n/an/an/an/an/an/a
Wyeth-Ayerst Research
Assay Description
The HER-2 kinase autophosphorylation activity was measured by DELFIA/time-resolved fluorometry with excitation at 340 nm and emission at 615 nm. Po...
J Med Chem 44: 2719-34 (2001)
Article DOI: 10.1021/jm0005555
BindingDB Entry DOI: 10.7270/Q2PN93TS
Epidermal growth factor receptor
(Homo sapiens (Human))
BDBM4575
(4-anilinoquinazoline deriv. 10h | N-{4-[(3-bromoph...)
Show SMILES Brc1cccc(Nc2ncnc3ccc(NC(=O)C#CCN4CCOCC4)cc23)c1
Show InChI InChI=1S/C22H20BrN5O2/c23-16-3-1-4-17(13-16)27-22-19-14-18(6-7-20(19)24-15-25-22)26-21(29)5-2-8-28-9-11-30-12-10-28/h1,3-4,6-7,13-15H,8-12H2,(H,26,29)(H,24,25,27)
n/an/a 20n/an/an/an/a7.422
Wyeth-Ayerst Research
Assay Description
The EGF-R kinase autophosphorylation activity was measured by DELFIA/time-resolved fluorometry with excitation at 340 nm and emission at 615 nm. Po...
J Med Chem 44: 2719-34 (2001)
Article DOI: 10.1021/jm0005555
BindingDB Entry DOI: 10.7270/Q2PN93TS