BDBM458238 US10752615, Compound 136
SMILES: C=CC(=O)N1CC[C@@]2(C[C@@H](C2)n2c(NC(=O)c3ccc(s3)-c3ccnc4[nH]ccc34)nc3ccccc23)C1
InChI Key:
Data: 4 IC50
Activity Spreadsheet -- Enzyme Inhibition Constant Data from BindingDB
Found 4 hits for monomerid = 458238
Trg + Lig
Ki
nM
ΔG°
kcal/mole
IC50
nM
Kd
nM
EC50/IC50
nM
koff
s-1
kon
M-1s-1
pHTemp
°C
Tyrosine-protein kinase ITK/TSK
(Homo sapiens (Human))
BDBM458238
(US10752615, Compound 136)
Show SMILES C=CC(=O)N1CC[C@@]2(C[C@@H](C2)n2c(NC(=O)c3ccc(s3)-c3ccnc4[nH]ccc34)nc3ccccc23)C1 |r,wU:9.11,7.10,(-5.39,-6.68,;-4.99,-5.2,;-3.51,-4.8,;-2.42,-5.89,;-3.11,-3.31,;-1.64,-2.84,;-1.64,-1.3,;-3.11,-.82,;-2.34,.51,;-3.67,1.28,;-4.44,-.05,;-4.07,2.77,;-3.16,4.02,;-1.62,4.02,;-.85,5.35,;-1.62,6.68,;.69,5.35,;1.59,6.6,;3.06,6.12,;3.06,4.58,;1.59,4.11,;4.39,3.81,;4.39,2.27,;5.72,1.5,;7.06,2.27,;7.06,3.81,;8.2,4.84,;7.57,6.25,;6.04,6.09,;5.72,4.58,;-4.07,5.26,;-5.53,4.79,;-6.87,5.56,;-8.2,4.79,;-8.2,3.25,;-6.87,2.48,;-5.53,3.25,;-4.01,-2.07,)|
Reactome pathway
US Patent
n/an/a 0.890n/an/an/an/an/an/a
GB005, Inc.
US Patent
Assay Description
The in vitro kinase assays were performed at Nanosyn (Santa Clara, Calif.) utilizing microfluidic detection technology. The test compounds were seria...
US Patent US10752615 (2020)
Tyrosine-protein kinase TEC
(Homo sapiens (Human))
BDBM458238
(US10752615, Compound 136)
Show SMILES C=CC(=O)N1CC[C@@]2(C[C@@H](C2)n2c(NC(=O)c3ccc(s3)-c3ccnc4[nH]ccc34)nc3ccccc23)C1 |r,wU:9.11,7.10,(-5.39,-6.68,;-4.99,-5.2,;-3.51,-4.8,;-2.42,-5.89,;-3.11,-3.31,;-1.64,-2.84,;-1.64,-1.3,;-3.11,-.82,;-2.34,.51,;-3.67,1.28,;-4.44,-.05,;-4.07,2.77,;-3.16,4.02,;-1.62,4.02,;-.85,5.35,;-1.62,6.68,;.69,5.35,;1.59,6.6,;3.06,6.12,;3.06,4.58,;1.59,4.11,;4.39,3.81,;4.39,2.27,;5.72,1.5,;7.06,2.27,;7.06,3.81,;8.2,4.84,;7.57,6.25,;6.04,6.09,;5.72,4.58,;-4.07,5.26,;-5.53,4.79,;-6.87,5.56,;-8.2,4.79,;-8.2,3.25,;-6.87,2.48,;-5.53,3.25,;-4.01,-2.07,)|
Reactome pathway
US Patent
n/an/a 0.0800n/an/an/an/an/an/a
GB005, Inc.
US Patent
Assay Description
The in vitro kinase assays were performed at Nanosyn (Santa Clara, Calif.) utilizing microfluidic detection technology. The test compounds were seria...
US Patent US10752615 (2020)
Tyrosine-protein kinase BTK
(Homo sapiens (Human))
BDBM458238
(US10752615, Compound 136)
Show SMILES C=CC(=O)N1CC[C@@]2(C[C@@H](C2)n2c(NC(=O)c3ccc(s3)-c3ccnc4[nH]ccc34)nc3ccccc23)C1 |r,wU:9.11,7.10,(-5.39,-6.68,;-4.99,-5.2,;-3.51,-4.8,;-2.42,-5.89,;-3.11,-3.31,;-1.64,-2.84,;-1.64,-1.3,;-3.11,-.82,;-2.34,.51,;-3.67,1.28,;-4.44,-.05,;-4.07,2.77,;-3.16,4.02,;-1.62,4.02,;-.85,5.35,;-1.62,6.68,;.69,5.35,;1.59,6.6,;3.06,6.12,;3.06,4.58,;1.59,4.11,;4.39,3.81,;4.39,2.27,;5.72,1.5,;7.06,2.27,;7.06,3.81,;8.2,4.84,;7.57,6.25,;6.04,6.09,;5.72,4.58,;-4.07,5.26,;-5.53,4.79,;-6.87,5.56,;-8.2,4.79,;-8.2,3.25,;-6.87,2.48,;-5.53,3.25,;-4.01,-2.07,)|
NCI pathway
Reactome pathway
US Patent
n/an/a 0.200n/an/an/an/an/an/a
GB005, Inc.
US Patent
Assay Description
The in vitro kinase assays were performed at Nanosyn (Santa Clara, Calif.) utilizing microfluidic detection technology. The test compounds were seria...
US Patent US10752615 (2020)
Tyrosine-protein kinase TXK
(Homo sapiens (Human))
BDBM458238
(US10752615, Compound 136)
Show SMILES C=CC(=O)N1CC[C@@]2(C[C@@H](C2)n2c(NC(=O)c3ccc(s3)-c3ccnc4[nH]ccc34)nc3ccccc23)C1 |r,wU:9.11,7.10,(-5.39,-6.68,;-4.99,-5.2,;-3.51,-4.8,;-2.42,-5.89,;-3.11,-3.31,;-1.64,-2.84,;-1.64,-1.3,;-3.11,-.82,;-2.34,.51,;-3.67,1.28,;-4.44,-.05,;-4.07,2.77,;-3.16,4.02,;-1.62,4.02,;-.85,5.35,;-1.62,6.68,;.69,5.35,;1.59,6.6,;3.06,6.12,;3.06,4.58,;1.59,4.11,;4.39,3.81,;4.39,2.27,;5.72,1.5,;7.06,2.27,;7.06,3.81,;8.2,4.84,;7.57,6.25,;6.04,6.09,;5.72,4.58,;-4.07,5.26,;-5.53,4.79,;-6.87,5.56,;-8.2,4.79,;-8.2,3.25,;-6.87,2.48,;-5.53,3.25,;-4.01,-2.07,)|
US Patent
n/an/a 0.160n/an/an/an/an/an/a
GB005, Inc.
US Patent
Assay Description
The in vitro kinase assays were performed at Nanosyn (Santa Clara, Calif.) utilizing microfluidic detection technology. The test compounds were seria...
US Patent US10752615 (2020)