BDBM46221 (4-nitrophenyl) 2-(2,6-dichlorophenoxy)acetate::(4-nitrophenyl) 2-[2,6-bis(chloranyl)phenoxy]ethanoate::2-(2,6-dichlorophenoxy)acetic acid (4-nitrophenyl) ester::MLS-0412049.0001::cid_818221
SMILES: [O-][N+](=O)c1ccc(OC(=O)COc2c(Cl)cccc2Cl)cc1
InChI Key: InChIKey=YGVZCUGTPCFIJD-UHFFFAOYSA-N
Data: 7 IC50
Activity Spreadsheet -- Enzyme Inhibition Constant Data from BindingDB
Found 7 hits for monomerid = 46221
Trg + Lig
Ki
nM
ΔG°
kcal/mole
IC50
nM
Kd
nM
EC50/IC50
nM
koff
s-1
kon
M-1s-1
pHTemp
°C
Hematopoietic protein-tyrosine phosphatase (HEPTP)
(Homo sapiens (Human))
BDBM46221
((4-nitrophenyl) 2-(2,6-dichlorophenoxy)acetate | (...)
Show SMILES [O-][N+](=O)c1ccc(OC(=O)COc2c(Cl)cccc2Cl)cc1
Show InChI InChI=1S/C14H9Cl2NO5/c15-11-2-1-3-12(16)14(11)21-8-13(18)22-10-6-4-9(5-7-10)17(19)20/h1-7H,8H2
PCBioAssay
n/an/a 2.22E+4n/an/an/an/an/an/a
Burnham Center for Chemical Genomics
Curated by PubChem BioAssay
Assay Description
Data Source: Sanford-Burnham Center for Chemical Genomics (SBCCG) Source Affiliation: Sanford-Burnham Medical Research Institute (SBMRI, San Diego, C...
PubChem Bioassay (2009)
BindingDB Entry DOI: 10.7270/Q2474894
Dual specificity protein phosphatase (VHR)
(Homo sapiens (Human))
BDBM46221
((4-nitrophenyl) 2-(2,6-dichlorophenoxy)acetate | (...)
Show SMILES [O-][N+](=O)c1ccc(OC(=O)COc2c(Cl)cccc2Cl)cc1
Show InChI InChI=1S/C14H9Cl2NO5/c15-11-2-1-3-12(16)14(11)21-8-13(18)22-10-6-4-9(5-7-10)17(19)20/h1-7H,8H2
Reactome pathway
PCBioAssay
n/an/a>9.90E+4n/an/an/an/an/an/a
Burnham Center for Chemical Genomics
Curated by PubChem BioAssay
Assay Description
Data Source: Sanford-Burnham Center for Chemical Genomics (SBCCG) Source Affiliation: Sanford-Burnham Medical Research Institute (SBMRI, San Diego, C...
PubChem Bioassay (2009)
BindingDB Entry DOI: 10.7270/Q2DB807Z
Dual specificity protein phosphatase (VHR)
(Homo sapiens (Human))
BDBM46221
((4-nitrophenyl) 2-(2,6-dichlorophenoxy)acetate | (...)
Show SMILES [O-][N+](=O)c1ccc(OC(=O)COc2c(Cl)cccc2Cl)cc1
Show InChI InChI=1S/C14H9Cl2NO5/c15-11-2-1-3-12(16)14(11)21-8-13(18)22-10-6-4-9(5-7-10)17(19)20/h1-7H,8H2
Reactome pathway
PCBioAssay
n/an/a>1.00E+5n/an/an/an/an/an/a
Burnham Center for Chemical Genomics
Curated by PubChem BioAssay
Assay Description
Data Source: Sanford-Burnham Center for Chemical Genomics (SBCCG) Source Affiliation: Sanford-Burnham Medical Research Institute (SBMRI, San Diego, C...
PubChem Bioassay (2009)
BindingDB Entry DOI: 10.7270/Q28K77H7
tyrosine-protein phosphatase non-receptor type 12 isoform 2
(Homo sapiens (Human))
BDBM46221
((4-nitrophenyl) 2-(2,6-dichlorophenoxy)acetate | (...)
Show SMILES [O-][N+](=O)c1ccc(OC(=O)COc2c(Cl)cccc2Cl)cc1
Show InChI InChI=1S/C14H9Cl2NO5/c15-11-2-1-3-12(16)14(11)21-8-13(18)22-10-6-4-9(5-7-10)17(19)20/h1-7H,8H2
Reactome pathway
PCBioAssay
n/an/a 4.25E+4n/an/an/an/an/an/a
Burnham Center for Chemical Genomics
Curated by PubChem BioAssay
Assay Description
Data Source: Sanford-Burnham Center for Chemical Genomics (SBCCG) Source Affiliation: Sanford-Burnham Medical Research Institute (SBMRI, San Diego, C...
PubChem Bioassay (2010)
BindingDB Entry DOI: 10.7270/Q28G8J5T
Hematopoietic cell protein-tyrosine phosphatase 70Z-PEP
(Homo sapiens (Human))
BDBM46221
((4-nitrophenyl) 2-(2,6-dichlorophenoxy)acetate | (...)
Show SMILES [O-][N+](=O)c1ccc(OC(=O)COc2c(Cl)cccc2Cl)cc1
Show InChI InChI=1S/C14H9Cl2NO5/c15-11-2-1-3-12(16)14(11)21-8-13(18)22-10-6-4-9(5-7-10)17(19)20/h1-7H,8H2
PCBioAssay
n/an/a>1.00E+5n/an/an/an/an/an/a
Burnham Center for Chemical Genomics
Curated by PubChem BioAssay
Assay Description
Data Source: Sanford-Burnham Center for Chemical Genomics (SBCCG) Source Affiliation: Sanford-Burnham Medical Research Institute (SBMRI, San Diego, C...
PubChem Bioassay (2010)
BindingDB Entry DOI: 10.7270/Q2QZ28FP
Hematopoietic cell protein-tyrosine phosphatase 70Z-PEP
(Homo sapiens (Human))
BDBM46221
((4-nitrophenyl) 2-(2,6-dichlorophenoxy)acetate | (...)
Show SMILES [O-][N+](=O)c1ccc(OC(=O)COc2c(Cl)cccc2Cl)cc1
Show InChI InChI=1S/C14H9Cl2NO5/c15-11-2-1-3-12(16)14(11)21-8-13(18)22-10-6-4-9(5-7-10)17(19)20/h1-7H,8H2
PCBioAssay
n/an/a 6.37E+4n/an/an/an/an/an/a
Burnham Center for Chemical Genomics
Curated by PubChem BioAssay
Assay Description
Data Source: Sanford-Burnham Center for Chemical Genomics (SBCCG) Source Affiliation: Sanford-Burnham Medical Research Institute(SBMRI, San Diego, CA...
PubChem Bioassay (2010)
BindingDB Entry DOI: 10.7270/Q2M9073J
Hematopoietic protein-tyrosine phosphatase (HEPTP)
(Homo sapiens (Human))
BDBM46221
((4-nitrophenyl) 2-(2,6-dichlorophenoxy)acetate | (...)
Show SMILES [O-][N+](=O)c1ccc(OC(=O)COc2c(Cl)cccc2Cl)cc1
Show InChI InChI=1S/C14H9Cl2NO5/c15-11-2-1-3-12(16)14(11)21-8-13(18)22-10-6-4-9(5-7-10)17(19)20/h1-7H,8H2
PCBioAssay
n/an/a 1.51E+4n/an/an/an/an/an/a
Burnham Center for Chemical Genomics
Curated by PubChem BioAssay
Assay Description
Data Source: Sanford-Burnham Center for Chemical Genomics (SBCCG) Source Affiliation: Sanford-Burnham Medical Research Institute (SBMRI, San Diego, C...
PubChem Bioassay (2009)
BindingDB Entry DOI: 10.7270/Q21N7ZJW