BDBM4645 4-Anilinoquinazoline 13::Anilinoquinazoline deriv. 28::N-(4-chloro-2-fluorophenyl)-6-methoxy-7-{2-[methyl(pyridin-4-yl)amino]ethoxy}quinazolin-4-amine
SMILES: COc1cc2c(Nc3ccc(Cl)cc3F)ncnc2cc1OCCN(C)c1ccncc1
InChI Key: InChIKey=HTZZYCNEQVCJJB-UHFFFAOYSA-N
Data: 7 IC50
Activity Spreadsheet -- Enzyme Inhibition Constant Data from BindingDB
Found 7 hits for monomerid = 4645
Trg + Lig
Ki
nM
ΔG°
kcal/mole
IC50
nM
Kd
nM
EC50/IC50
nM
koff
s-1
kon
M-1s-1
pHTemp
°C
Vascular endothelial growth factor receptor 1
(Homo sapiens (Human))
BDBM4645
(4-Anilinoquinazoline 13 | Anilinoquinazoline deriv...)
Show SMILES COc1cc2c(Nc3ccc(Cl)cc3F)ncnc2cc1OCCN(C)c1ccncc1
Show InChI InChI=1S/C23H21ClFN5O2/c1-30(16-5-7-26-8-6-16)9-10-32-22-13-20-17(12-21(22)31-2)23(28-14-27-20)29-19-4-3-15(24)11-18(19)25/h3-8,11-14H,9-10H2,1-2H3,(H,27,28,29)
n/an/a 100n/an/an/an/an/a25
AstraZeneca
Assay Description
An ELISA assay was used to determine the ability of inhibitor to inhibit VEGF-R RTK activity. The compounds were incubated with enzyme 20 min at room...
J Med Chem 42: 5369-89 (1999)
Article DOI: 10.1021/jm990345w
BindingDB Entry DOI: 10.7270/Q2F47MBM
Vascular endothelial growth factor receptor 2
(Homo sapiens (Human))
BDBM4645
(4-Anilinoquinazoline 13 | Anilinoquinazoline deriv...)
Show SMILES COc1cc2c(Nc3ccc(Cl)cc3F)ncnc2cc1OCCN(C)c1ccncc1
Show InChI InChI=1S/C23H21ClFN5O2/c1-30(16-5-7-26-8-6-16)9-10-32-22-13-20-17(12-21(22)31-2)23(28-14-27-20)29-19-4-3-15(24)11-18(19)25/h3-8,11-14H,9-10H2,1-2H3,(H,27,28,29)
NCI pathway
Reactome pathway
n/an/a 6n/an/an/an/an/a25
AstraZeneca
Assay Description
An ELISA assay was used to determine the ability of inhibitor to inhibit VEGF-R RTK activity. The compounds were incubated with enzyme 20 min at room...
J Med Chem 42: 5369-89 (1999)
Article DOI: 10.1021/jm990345w
BindingDB Entry DOI: 10.7270/Q2F47MBM
Fibroblast growth factor receptor 1
(Homo sapiens (Human))
BDBM4645
(4-Anilinoquinazoline 13 | Anilinoquinazoline deriv...)
Show SMILES COc1cc2c(Nc3ccc(Cl)cc3F)ncnc2cc1OCCN(C)c1ccncc1
Show InChI InChI=1S/C23H21ClFN5O2/c1-30(16-5-7-26-8-6-16)9-10-32-22-13-20-17(12-21(22)31-2)23(28-14-27-20)29-19-4-3-15(24)11-18(19)25/h3-8,11-14H,9-10H2,1-2H3,(H,27,28,29)
NCI pathway
Reactome pathway
n/an/a 1.60E+3n/an/an/an/an/a25
AstraZeneca
Assay Description
An ELISA assay was used to determine the ability of inhibitor to inhibit FGFR-1 TK activity. The compounds were incubated with enzyme 20 min at room ...
J Med Chem 42: 5369-89 (1999)
Article DOI: 10.1021/jm990345w
BindingDB Entry DOI: 10.7270/Q2F47MBM
Epidermal growth factor receptor
(Homo sapiens (Human))
BDBM4645
(4-Anilinoquinazoline 13 | Anilinoquinazoline deriv...)
Show SMILES COc1cc2c(Nc3ccc(Cl)cc3F)ncnc2cc1OCCN(C)c1ccncc1
Show InChI InChI=1S/C23H21ClFN5O2/c1-30(16-5-7-26-8-6-16)9-10-32-22-13-20-17(12-21(22)31-2)23(28-14-27-20)29-19-4-3-15(24)11-18(19)25/h3-8,11-14H,9-10H2,1-2H3,(H,27,28,29)
n/an/a 300n/an/an/an/an/a25
AstraZeneca
Assay Description
An ELISA assay was used to determine the ability of inhibitor to inhibit EGF-R RTK activity. The compounds were incubated with enzyme 20 min at room ...
J Med Chem 45: 1300-12 (2002)
Article DOI: 10.1021/jm011022e
BindingDB Entry DOI: 10.7270/Q29C6VMW
Vascular endothelial growth factor receptor 2
(Homo sapiens (Human))
BDBM4645
(4-Anilinoquinazoline 13 | Anilinoquinazoline deriv...)
Show SMILES COc1cc2c(Nc3ccc(Cl)cc3F)ncnc2cc1OCCN(C)c1ccncc1
Show InChI InChI=1S/C23H21ClFN5O2/c1-30(16-5-7-26-8-6-16)9-10-32-22-13-20-17(12-21(22)31-2)23(28-14-27-20)29-19-4-3-15(24)11-18(19)25/h3-8,11-14H,9-10H2,1-2H3,(H,27,28,29)
NCI pathway
Reactome pathway
n/an/a 6n/an/an/an/an/a25
AstraZeneca
Assay Description
An ELISA assay was used to determine the ability of inhibitor to inhibit VEGF-R RTK activity. The compounds were incubated with enzyme 20 min at room...
J Med Chem 45: 1300-12 (2002)
Article DOI: 10.1021/jm011022e
BindingDB Entry DOI: 10.7270/Q29C6VMW
Fibroblast growth factor receptor 1
(Homo sapiens (Human))
BDBM4645
(4-Anilinoquinazoline 13 | Anilinoquinazoline deriv...)
Show SMILES COc1cc2c(Nc3ccc(Cl)cc3F)ncnc2cc1OCCN(C)c1ccncc1
Show InChI InChI=1S/C23H21ClFN5O2/c1-30(16-5-7-26-8-6-16)9-10-32-22-13-20-17(12-21(22)31-2)23(28-14-27-20)29-19-4-3-15(24)11-18(19)25/h3-8,11-14H,9-10H2,1-2H3,(H,27,28,29)
NCI pathway
Reactome pathway
n/an/a 1.60E+3n/an/an/an/an/a25
AstraZeneca
Assay Description
An ELISA assay was used to determine the ability of inhibitor to inhibit FGFR-1 TK activity. The compounds were incubated with enzyme 20 min at room ...
J Med Chem 45: 1300-12 (2002)
Article DOI: 10.1021/jm011022e
BindingDB Entry DOI: 10.7270/Q29C6VMW
Vascular endothelial growth factor receptor 1
(Homo sapiens (Human))
BDBM4645
(4-Anilinoquinazoline 13 | Anilinoquinazoline deriv...)
Show SMILES COc1cc2c(Nc3ccc(Cl)cc3F)ncnc2cc1OCCN(C)c1ccncc1
Show InChI InChI=1S/C23H21ClFN5O2/c1-30(16-5-7-26-8-6-16)9-10-32-22-13-20-17(12-21(22)31-2)23(28-14-27-20)29-19-4-3-15(24)11-18(19)25/h3-8,11-14H,9-10H2,1-2H3,(H,27,28,29)
n/an/a 100n/an/an/an/a7.422
AstraZeneca
Assay Description
An ELISA assay was used to determine the ability of inhibitor to inhibit VEGF-R RTK activity. The compounds were incubated with enzyme 20 min at room...
J Med Chem 45: 1300-12 (2002)
Article DOI: 10.1021/jm011022e
BindingDB Entry DOI: 10.7270/Q29C6VMW