BDBM4751 (3S,4S)-3-carbamimidamido-4-[(S)-acetamido[(1-methoxybutan-2-yl)carbamoyl]methyl]cyclopentane-1-carboxylic acid::Cyclopentane Amide deriv. 14n
SMILES: [#6]-[#6]-[#6](-[#6]-[#8]-[#6])-[#7]-[#6](=O)-[#6](-[#7]-[#6](-[#6])=O)-[#6@H]-1-[#6]-[#6](-[#6]-[#6@@H]-1\[#7]=[#6](\[#7])-[#7])-[#6](-[#8])=O
InChI Key: InChIKey=GXBYHDNSUOJGPX-DNDUJMJNSA-N
Data: 2 IC50
Activity Spreadsheet -- Enzyme Inhibition Constant Data from BindingDB
Found 2 hits for monomerid = 4751
Trg + Lig
Ki
nM
ΔG°
kcal/mole
IC50
nM
Kd
nM
EC50/IC50
nM
koff
s-1
kon
M-1s-1
pHTemp
°C
Neuraminidase B
(Influenza B virus (B/Lee/40))
BDBM4751
((3S,4S)-3-carbamimidamido-4-[(S)-acetamido[(1-meth...)
Show SMILES [#6]-[#6]-[#6](-[#6]-[#8]-[#6])-[#7]-[#6](=O)-[#6](-[#7]-[#6](-[#6])=O)-[#6@H]-1-[#6]-[#6](-[#6]-[#6@@H]-1\[#7]=[#6](\[#7])-[#7])-[#6](-[#8])=O |r,w:16.23,9.9|
Show InChI InChI=1S/C16H29N5O5/c1-4-10(7-26-3)20-14(23)13(19-8(2)22)11-5-9(15(24)25)6-12(11)21-16(17)18/h9-13H,4-7H2,1-3H3,(H,19,22)(H,20,23)(H,24,25)(H4,17,18,21)/t9?,10?,11-,12-,13?/m0/s1
n/an/a 2.00E+4n/an/an/an/an/an/a
BioCryst Pharmaceuticals, Inc.
Assay Description
A standard fluorimetric assay was used to measure influenza virus neuraminidase activity. The substrate 2 -(4-methylumbelliferyl)-alpha-D-acetylneura...
J Med Chem 47: 1919-29 (2004)
Article DOI: 10.1021/jm0303406
BindingDB Entry DOI: 10.7270/Q2NP22NH
Neuraminidase A
(Influenza A virus (N9))
BDBM4751
((3S,4S)-3-carbamimidamido-4-[(S)-acetamido[(1-meth...)
Show SMILES [#6]-[#6]-[#6](-[#6]-[#8]-[#6])-[#7]-[#6](=O)-[#6](-[#7]-[#6](-[#6])=O)-[#6@H]-1-[#6]-[#6](-[#6]-[#6@@H]-1\[#7]=[#6](\[#7])-[#7])-[#6](-[#8])=O |r,w:16.23,9.9|
Show InChI InChI=1S/C16H29N5O5/c1-4-10(7-26-3)20-14(23)13(19-8(2)22)11-5-9(15(24)25)6-12(11)21-16(17)18/h9-13H,4-7H2,1-3H3,(H,19,22)(H,20,23)(H,24,25)(H4,17,18,21)/t9?,10?,11-,12-,13?/m0/s1
n/an/a 2.20E+3n/an/an/an/a6.537
BioCryst Pharmaceuticals, Inc.
Assay Description
A standard fluorimetric assay was used to measure influenza virus neuraminidase activity. The substrate 2 -(4-methylumbelliferyl)-alpha-D-acetylneura...
J Med Chem 47: 1919-29 (2004)
Article DOI: 10.1021/jm0303406
BindingDB Entry DOI: 10.7270/Q2NP22NH