BDBM4753 (3S,4S)-3-carbamimidamido-4-[(S)-acetamido[methyl(propan-2-yl)carbamoyl]methyl]cyclopentane-1-carboxylic acid::Cyclopentane Amide deriv. 15b
SMILES: [#6]-[#6](-[#6])-[#7](-[#6])-[#6](=O)-[#6](-[#7]-[#6](-[#6])=O)-[#6@H]-1-[#6]-[#6](-[#6]-[#6@@H]-1\[#7]=[#6](\[#7])-[#7])-[#6](-[#8])=O
InChI Key: InChIKey=ILJAJFVNMDWBMX-YECOWLKZSA-N
Data: 2 IC50
Activity Spreadsheet -- Enzyme Inhibition Constant Data from BindingDB
Found 2 hits for monomerid = 4753
Trg + Lig
Ki
nM
ΔG°
kcal/mole
IC50
nM
Kd
nM
EC50/IC50
nM
koff
s-1
kon
M-1s-1
pHTemp
°C
Neuraminidase B
(Influenza B virus (B/Lee/40))
BDBM4753
((3S,4S)-3-carbamimidamido-4-[(S)-acetamido[methyl(...)
Show SMILES [#6]-[#6](-[#6])-[#7](-[#6])-[#6](=O)-[#6](-[#7]-[#6](-[#6])=O)-[#6@H]-1-[#6]-[#6](-[#6]-[#6@@H]-1\[#7]=[#6](\[#7])-[#7])-[#6](-[#8])=O |r,w:14.21,7.7|
Show InChI InChI=1S/C15H27N5O4/c1-7(2)20(4)13(22)12(18-8(3)21)10-5-9(14(23)24)6-11(10)19-15(16)17/h7,9-12H,5-6H2,1-4H3,(H,18,21)(H,23,24)(H4,16,17,19)/t9?,10-,11-,12?/m0/s1
n/an/a 6.80E+3n/an/an/an/an/an/a
BioCryst Pharmaceuticals, Inc.
Assay Description
A standard fluorimetric assay was used to measure influenza virus neuraminidase activity. The substrate 2 -(4-methylumbelliferyl)-alpha-D-acetylneura...
J Med Chem 47: 1919-29 (2004)
Article DOI: 10.1021/jm0303406
BindingDB Entry DOI: 10.7270/Q2NP22NH
Neuraminidase A
(Influenza A virus (N9))
BDBM4753
((3S,4S)-3-carbamimidamido-4-[(S)-acetamido[methyl(...)
Show SMILES [#6]-[#6](-[#6])-[#7](-[#6])-[#6](=O)-[#6](-[#7]-[#6](-[#6])=O)-[#6@H]-1-[#6]-[#6](-[#6]-[#6@@H]-1\[#7]=[#6](\[#7])-[#7])-[#6](-[#8])=O |r,w:14.21,7.7|
Show InChI InChI=1S/C15H27N5O4/c1-7(2)20(4)13(22)12(18-8(3)21)10-5-9(14(23)24)6-11(10)19-15(16)17/h7,9-12H,5-6H2,1-4H3,(H,18,21)(H,23,24)(H4,16,17,19)/t9?,10-,11-,12?/m0/s1
n/an/a 3.21E+3n/an/an/an/a6.537
BioCryst Pharmaceuticals, Inc.
Assay Description
A standard fluorimetric assay was used to measure influenza virus neuraminidase activity. The substrate 2 -(4-methylumbelliferyl)-alpha-D-acetylneura...
J Med Chem 47: 1919-29 (2004)
Article DOI: 10.1021/jm0303406
BindingDB Entry DOI: 10.7270/Q2NP22NH