BDBM47862 2-(1-benzotriazolyl)-1-(4-bromophenyl)ethanone::2-(benzotriazol-1-yl)-1-(4-bromophenyl)ethanone::MLS000712897::SMR000282664::cid_761840
SMILES: Brc1ccc(cc1)C(=O)Cn1nnc2ccccc12
InChI Key: InChIKey=VGUSWIHOGHPDPF-UHFFFAOYSA-N
Data: 2 IC50
Activity Spreadsheet -- Enzyme Inhibition Constant Data from BindingDB
Found 2 hits for monomerid = 47862
Trg + Lig
Ki
nM
ΔG°
kcal/mole
IC50
nM
Kd
nM
EC50/IC50
nM
koff
s-1
kon
M-1s-1
pHTemp
°C
Probable maltase-glucoamylase 2
(Homo sapiens)
BDBM47862
(2-(1-benzotriazolyl)-1-(4-bromophenyl)ethanone | 2...)
Show SMILES Brc1ccc(cc1)C(=O)Cn1nnc2ccccc12
Show InChI InChI=1S/C14H10BrN3O/c15-11-7-5-10(6-8-11)14(19)9-18-13-4-2-1-3-12(13)16-17-18/h1-8H,9H2
n/an/a 2.79E+3n/an/an/an/an/an/a
University of Karachi
Curated by ChEMBL
Assay Description
Inhibition of alpha-glucosidase (unknown origin)
Eur J Med Chem 183: (2019)
Article DOI: 10.1016/j.ejmech.2019.111677
3C-like protease
(Avian infectious bronchitis virus)
BDBM47862
(2-(1-benzotriazolyl)-1-(4-bromophenyl)ethanone | 2...)
Show SMILES Brc1ccc(cc1)C(=O)Cn1nnc2ccccc12
Show InChI InChI=1S/C14H10BrN3O/c15-11-7-5-10(6-8-11)14(19)9-18-13-4-2-1-3-12(13)16-17-18/h1-8H,9H2
PCBioAssay
n/an/a 4.01E+3n/an/an/an/an/an/a
The Scripps Research Institute Molecular Screening Center
Curated by PubChem BioAssay
Assay Description
Source (MLPCN Center Name): The Scripps Research Institute Molecular Screening Center (SRIMSC) Center Affiliation: The Scripps Research Institute (TS...
PubChem Bioassay (2009)
BindingDB Entry DOI: 10.7270/Q29K48NM