BDBM47871 4-[4-[3-(trifluoromethyl)phenyl]piperazin-1-yl]carbonyl-1H-quinolin-2-one::4-[4-[3-(trifluoromethyl)phenyl]piperazine-1-carbonyl]-1H-quinolin-2-one::4-[4-[3-(trifluoromethyl)phenyl]piperazine-1-carbonyl]carbostyril::4-[oxo-[4-[3-(trifluoromethyl)phenyl]-1-piperazinyl]methyl]-1H-quinolin-2-one::ERI-UCB-a0b0dbcb-4::MLS000760808::SMR000370919::cid_2449860
SMILES: FC(F)(F)c1cccc(c1)N1CCN(CC1)C(=O)c1cc(=O)[nH]c2ccccc12
InChI Key: InChIKey=NKHDYQSOEVSMNT-UHFFFAOYSA-N
Data: 3 IC50
Activity Spreadsheet -- Enzyme Inhibition Constant Data from BindingDB
Found 3 hits for monomerid = 47871
Trg + Lig
Ki
nM
ΔG°
kcal/mole
IC50
nM
Kd
nM
EC50/IC50
nM
koff
s-1
kon
M-1s-1
pHTemp
°C
3C-like protease
(Avian infectious bronchitis virus)
BDBM47871
(4-[4-[3-(trifluoromethyl)phenyl]piperazin-1-yl]car...)
Show SMILES FC(F)(F)c1cccc(c1)N1CCN(CC1)C(=O)c1cc(=O)[nH]c2ccccc12
Show InChI InChI=1S/C21H18F3N3O2/c22-21(23,24)14-4-3-5-15(12-14)26-8-10-27(11-9-26)20(29)17-13-19(28)25-18-7-2-1-6-16(17)18/h1-7,12-13H,8-11H2,(H,25,28)
PCBioAssay
n/an/a 5.10E+3n/an/an/an/an/an/a
The Scripps Research Institute Molecular Screening Center
Curated by PubChem BioAssay
Assay Description
Source (MLPCN Center Name): The Scripps Research Institute Molecular Screening Center (SRIMSC) Center Affiliation: The Scripps Research Institute (TS...
PubChem Bioassay (2009)
BindingDB Entry DOI: 10.7270/Q29K48NM
Replicase polyprotein 1ab
(2019-nCoV)
BDBM47871
(4-[4-[3-(trifluoromethyl)phenyl]piperazin-1-yl]car...)
Show SMILES FC(F)(F)c1cccc(c1)N1CCN(CC1)C(=O)c1cc(=O)[nH]c2ccccc12
Show InChI InChI=1S/C21H18F3N3O2/c22-21(23,24)14-4-3-5-15(12-14)26-8-10-27(11-9-26)20(29)17-13-19(28)25-18-7-2-1-6-16(17)18/h1-7,12-13H,8-11H2,(H,25,28)
NCI pathway
Reactome pathway
n/an/a 3.80E+3n/an/an/an/an/an/a
Israel Institution of Biological Research
Assay Description
Compounds were seeded into assay-ready plates (Greiner 384 low volume, cat 784900) using an Echo 555 acoustic dispenser, and DMSO was back-filled for...
bioRxiv 2021: (2021)
Replicase polyprotein 1ab
(2019-nCoV)
BDBM47871
(4-[4-[3-(trifluoromethyl)phenyl]piperazin-1-yl]car...)
Show SMILES FC(F)(F)c1cccc(c1)N1CCN(CC1)C(=O)c1cc(=O)[nH]c2ccccc12
Show InChI InChI=1S/C21H18F3N3O2/c22-21(23,24)14-4-3-5-15(12-14)26-8-10-27(11-9-26)20(29)17-13-19(28)25-18-7-2-1-6-16(17)18/h1-7,12-13H,8-11H2,(H,25,28)
NCI pathway
Reactome pathway
n/an/a 5.65E+3n/an/an/an/an/an/a
Israel Institution of Biological Research
Assay Description
The assay was performed according to the published procedure. Briefly, compounds were seeded into assay-ready plates (Greiner 384PP, cat# 781280) usi...
bioRxiv 2021: (2021)