BDBM47905 2-chloranyl-1-[3-(furan-2-yl)-5-(5-methylfuran-2-yl)-3,4-dihydropyrazol-2-yl]ethanone::2-chloro-1-[3-(2-furanyl)-5-(5-methyl-2-furanyl)-3,4-dihydropyrazol-2-yl]ethanone::2-chloro-1-[3-(furan-2-yl)-5-(5-methylfuran-2-yl)-3,4-dihydropyrazol-2-yl]ethanone::2-chloro-1-[5-(2-furyl)-3-(5-methyl-2-furyl)-2-pyrazolin-1-yl]ethanone::MLS001179882::SMR000595582::cid_4961646
SMILES: Cc1ccc(o1)C1=NN(C(C1)c1ccco1)C(=O)CCl
InChI Key: InChIKey=YRKAJCPZVCIZEW-UHFFFAOYSA-N
Data: 1 IC50
Activity Spreadsheet -- Enzyme Inhibition Constant Data from BindingDB
Found 1 hit for monomerid = 47905
Trg + Lig
Ki
nM
ΔG°
kcal/mole
IC50
nM
Kd
nM
EC50/IC50
nM
koff
s-1
kon
M-1s-1
pHTemp
°C
3C-like protease
(Avian infectious bronchitis virus)
BDBM47905
(2-chloranyl-1-[3-(furan-2-yl)-5-(5-methylfuran-2-y...)
Show SMILES Cc1ccc(o1)C1=NN(C(C1)c1ccco1)C(=O)CCl |t:7|
Show InChI InChI=1S/C14H13ClN2O3/c1-9-4-5-12(20-9)10-7-11(13-3-2-6-19-13)17(16-10)14(18)8-15/h2-6,11H,7-8H2,1H3
PCBioAssay
n/an/a 5.20E+3n/an/an/an/an/an/a
The Scripps Research Institute Molecular Screening Center
Curated by PubChem BioAssay
Assay Description
Source (MLPCN Center Name): The Scripps Research Institute Molecular Screening Center (SRIMSC) Center Affiliation: The Scripps Research Institute (TS...
PubChem Bioassay (2009)
BindingDB Entry DOI: 10.7270/Q29K48NM