BDBM47924 2-(3-amino-3-oxopropyl)-3-(4-methylbenzoyl)-2H-indazole 1-oxide::3-(1-oxido-3-p-toluoyl-indazol-1-ium-2-yl)propionamide::3-[3-(4-methylbenzoyl)-1-oxidoindazol-1-ium-2-yl]propanamide::3-[3-(4-methylphenyl)carbonyl-1-oxidanidyl-indazol-1-ium-2-yl]propanamide::3-[3-[(4-methylphenyl)-oxomethyl]-1-oxido-2-indazol-1-iumyl]propanamide::MLS001097173::SMR000718357::cid_24817254
SMILES: Cc1ccc(cc1)C(=O)c1n(CCC(N)=O)[n+]([O-])c2ccccc12
InChI Key: InChIKey=FSPIJWMTJVRVQG-UHFFFAOYSA-N
Data: 1 IC50
Activity Spreadsheet -- Enzyme Inhibition Constant Data from BindingDB
Found 1 hit for monomerid = 47924
Trg + Lig
Ki
nM
ΔG°
kcal/mole
IC50
nM
Kd
nM
EC50/IC50
nM
koff
s-1
kon
M-1s-1
pHTemp
°C
3C-like protease
(Avian infectious bronchitis virus)
BDBM47924
(2-(3-amino-3-oxopropyl)-3-(4-methylbenzoyl)-2H-ind...)
Show SMILES Cc1ccc(cc1)C(=O)c1n(CCC(N)=O)[n+]([O-])c2ccccc12
Show InChI InChI=1S/C18H17N3O3/c1-12-6-8-13(9-7-12)18(23)17-14-4-2-3-5-15(14)21(24)20(17)11-10-16(19)22/h2-9H,10-11H2,1H3,(H2,19,22)
PCBioAssay
n/an/a 9.36E+3n/an/an/an/an/an/a
The Scripps Research Institute Molecular Screening Center
Curated by PubChem BioAssay
Assay Description
Source (MLPCN Center Name): The Scripps Research Institute Molecular Screening Center (SRIMSC) Center Affiliation: The Scripps Research Institute (TS...
PubChem Bioassay (2009)
BindingDB Entry DOI: 10.7270/Q29K48NM