BDBM4872 1-(4-tert-Butylanilino)-4-(4-pyridylmethyl)phthalazine Dihydrochloride::CGP79787 Analog 57::N-(4-tert-butylphenyl)-4-(pyridin-4-ylmethyl)phthalazin-1-amine
SMILES: CC(C)(C)c1ccc(Nc2nnc(Cc3ccncc3)c3ccccc23)cc1
InChI Key: InChIKey=MSXAXOGMQYORSO-UHFFFAOYSA-N
Data: 4 IC50
Activity Spreadsheet -- Enzyme Inhibition Constant Data from BindingDB
Found 4 hits for monomerid = 4872
Trg + Lig
Ki
nM
ΔG°
kcal/mole
IC50
nM
Kd
nM
EC50/IC50
nM
koff
s-1
kon
M-1s-1
pHTemp
°C
Vascular endothelial growth factor receptor 1
(Homo sapiens (Human))
BDBM4872
(1-(4-tert-Butylanilino)-4-(4-pyridylmethyl)phthala...)
Show SMILES CC(C)(C)c1ccc(Nc2nnc(Cc3ccncc3)c3ccccc23)cc1
Show InChI InChI=1S/C24H24N4/c1-24(2,3)18-8-10-19(11-9-18)26-23-21-7-5-4-6-20(21)22(27-28-23)16-17-12-14-25-15-13-17/h4-15H,16H2,1-3H3,(H,26,28)
n/an/a 240n/an/an/an/an/an/a
Novartis Pharmaceuticals
Assay Description
The in vitro kinase assays were performed in 96-well plates using the recombinant GST-fused kinase domains expressed in baculovirus and purified over...
J Med Chem 43: 2310-23 (2000)
Article DOI: 10.1021/jm9909443
BindingDB Entry DOI: 10.7270/Q24M92R5
Mast/stem cell growth factor receptor Kit
(Homo sapiens (Human))
BDBM4872
(1-(4-tert-Butylanilino)-4-(4-pyridylmethyl)phthala...)
Show SMILES CC(C)(C)c1ccc(Nc2nnc(Cc3ccncc3)c3ccccc23)cc1
Show InChI InChI=1S/C24H24N4/c1-24(2,3)18-8-10-19(11-9-18)26-23-21-7-5-4-6-20(21)22(27-28-23)16-17-12-14-25-15-13-17/h4-15H,16H2,1-3H3,(H,26,28)
n/an/a 1.00E+3n/an/an/an/an/an/a
Novartis Pharmaceuticals
Assay Description
The in vitro kinase assays were performed in 96-well plates using the recombinant GST-fused kinase domains expressed in baculovirus and purified over...
J Med Chem 43: 2310-23 (2000)
Article DOI: 10.1021/jm9909443
BindingDB Entry DOI: 10.7270/Q24M92R5
Platelet-derived growth factor receptor beta
(Homo sapiens (Human))
BDBM4872
(1-(4-tert-Butylanilino)-4-(4-pyridylmethyl)phthala...)
Show SMILES CC(C)(C)c1ccc(Nc2nnc(Cc3ccncc3)c3ccccc23)cc1
Show InChI InChI=1S/C24H24N4/c1-24(2,3)18-8-10-19(11-9-18)26-23-21-7-5-4-6-20(21)22(27-28-23)16-17-12-14-25-15-13-17/h4-15H,16H2,1-3H3,(H,26,28)
NCI pathway
Reactome pathway
n/an/a 2.00E+3n/an/an/an/an/an/a
Novartis Pharmaceuticals
Assay Description
The autophosphorylation assay was performed in 96-well plates using the recombinant GST-fused kinase domains expressed in baculovirus and purified ov...
J Med Chem 43: 2310-23 (2000)
Article DOI: 10.1021/jm9909443
BindingDB Entry DOI: 10.7270/Q24M92R5
Vascular endothelial growth factor receptor 2
(Homo sapiens (Human))
BDBM4872
(1-(4-tert-Butylanilino)-4-(4-pyridylmethyl)phthala...)
Show SMILES CC(C)(C)c1ccc(Nc2nnc(Cc3ccncc3)c3ccccc23)cc1
Show InChI InChI=1S/C24H24N4/c1-24(2,3)18-8-10-19(11-9-18)26-23-21-7-5-4-6-20(21)22(27-28-23)16-17-12-14-25-15-13-17/h4-15H,16H2,1-3H3,(H,26,28)
NCI pathway
Reactome pathway
n/an/a 210n/an/an/an/an/an/a
Novartis Pharmaceuticals
Assay Description
The in vitro kinase assays were performed in 96-well plates using the recombinant GST-fused kinase domains expressed in baculovirus and purified over...
J Med Chem 43: 2310-23 (2000)
Article DOI: 10.1021/jm9909443
BindingDB Entry DOI: 10.7270/Q24M92R5