BDBM49132 6-(1,4-dioxa-8-azaspiro[4.5]dec-8-ylcarbonyl)-2,3-di-2-furylquinoxaline::MLS000094621::SMR000030174::[2,3-bis(2-furanyl)-6-quinoxalinyl]-(1,4-dioxa-8-azaspiro[4.5]decan-8-yl)methanone::[2,3-bis(2-furyl)quinoxalin-6-yl]-(1,4-dioxa-8-azaspiro[4.5]decan-8-yl)methanone::[2,3-bis(furan-2-yl)quinoxalin-6-yl]-(1,4-dioxa-8-azaspiro[4.5]decan-8-yl)methanone::cid_3236963
SMILES: O=C(N1CCC2(CC1)OCCO2)c1ccc2nc(-c3ccco3)c(nc2c1)-c1ccco1
InChI Key: InChIKey=JXQKGXOGDLTSGE-UHFFFAOYSA-N
Data: 4 IC50
Activity Spreadsheet -- Enzyme Inhibition Constant Data from BindingDB
Found 4 hits for monomerid = 49132
Trg + Lig
Ki
nM
ΔG°
kcal/mole
IC50
nM
Kd
nM
EC50/IC50
nM
koff
s-1
kon
M-1s-1
pHTemp
°C
Estradiol receptor beta (ERβ)
(Homo sapiens (Human))
BDBM49132
(6-(1,4-dioxa-8-azaspiro[4.5]dec-8-ylcarbonyl)-2,3-...)
Show SMILES O=C(N1CCC2(CC1)OCCO2)c1ccc2nc(-c3ccco3)c(nc2c1)-c1ccco1
Show InChI InChI=1S/C24H21N3O5/c28-23(27-9-7-24(8-10-27)31-13-14-32-24)16-5-6-17-18(15-16)26-22(20-4-2-12-30-20)21(25-17)19-3-1-11-29-19/h1-6,11-12,15H,7-10,13-14H2
PCBioAssay
n/an/a 8.97E+3n/an/an/an/an/an/a
Emory University Molecular Libraries Screening Center
Curated by PubChem BioAssay
Assay Description
NIH Molecular Libraries Screening Centers Network [MLSCN] Emory Chemical Biology Discovery Center in MLSCN Assay provider: John A. Katzenellenbogen, ...
PubChem Bioassay (2008)
BindingDB Entry DOI: 10.7270/Q2CF9NHH
neuronal munc18-1 binding protein
(Rattus norvegicus)
BDBM49132
(6-(1,4-dioxa-8-azaspiro[4.5]dec-8-ylcarbonyl)-2,3-...)
Show SMILES O=C(N1CCC2(CC1)OCCO2)c1ccc2nc(-c3ccco3)c(nc2c1)-c1ccco1
Show InChI InChI=1S/C24H21N3O5/c28-23(27-9-7-24(8-10-27)31-13-14-32-24)16-5-6-17-18(15-16)26-22(20-4-2-12-30-20)21(25-17)19-3-1-11-29-19/h1-6,11-12,15H,7-10,13-14H2
PCBioAssay
n/an/a>5.68E+4n/an/an/an/an/an/a
Burnham Center for Chemical Genomics
Curated by PubChem BioAssay
Assay Description
Data Source: Sanford-Burnham Center for Chemical Genomics (SBCCG) Source Affiliation: Sanford-Burnham Medical Research Institute (SBMRI, San Diego, C...
PubChem Bioassay (2010)
BindingDB Entry DOI: 10.7270/Q21V5CDC
Voltage-gated calcium channel subunit alpha Cav2.2
(Homo sapiens (Human))
BDBM49132
(6-(1,4-dioxa-8-azaspiro[4.5]dec-8-ylcarbonyl)-2,3-...)
Show SMILES O=C(N1CCC2(CC1)OCCO2)c1ccc2nc(-c3ccco3)c(nc2c1)-c1ccco1
Show InChI InChI=1S/C24H21N3O5/c28-23(27-9-7-24(8-10-27)31-13-14-32-24)16-5-6-17-18(15-16)26-22(20-4-2-12-30-20)21(25-17)19-3-1-11-29-19/h1-6,11-12,15H,7-10,13-14H2
PCBioAssay
n/an/a 2.45E+3n/an/an/an/an/an/a
Burnham Center for Chemical Genomics
Curated by PubChem BioAssay
Assay Description
Data Source: Data Source: Sanford-Burnham Center for Chemical Genomics (SBCCG) Source Affiliation: Sanford-Burnham Medical Research Institute Network...
PubChem Bioassay (2009)
BindingDB Entry DOI: 10.7270/Q2PZ578V
neuronal munc18-1 binding protein
(Rattus norvegicus)
BDBM49132
(6-(1,4-dioxa-8-azaspiro[4.5]dec-8-ylcarbonyl)-2,3-...)
Show SMILES O=C(N1CCC2(CC1)OCCO2)c1ccc2nc(-c3ccco3)c(nc2c1)-c1ccco1
Show InChI InChI=1S/C24H21N3O5/c28-23(27-9-7-24(8-10-27)31-13-14-32-24)16-5-6-17-18(15-16)26-22(20-4-2-12-30-20)21(25-17)19-3-1-11-29-19/h1-6,11-12,15H,7-10,13-14H2
PCBioAssay
n/an/a 1.39E+3n/an/an/an/an/an/a
Burnham Center for Chemical Genomics
Curated by PubChem BioAssay
Assay Description
Data Source: Sanford-Burnham Center for Chemical Genomics (SBCCG) Source Affiliation: Sanford-Burnham Medical Research Institute (SBMRI, San Diego, C...
PubChem Bioassay (2009)
BindingDB Entry DOI: 10.7270/Q20P0XFH