null
SMILES: CCCCCCCCCCCCCCCC(=O)N[C@@H](COP(O)(O)=O)CC(C)C
InChI Key: InChIKey=YKMRNEVICNBFHK-OAQYLSRUSA-N
Activity Spreadsheet -- Enzyme Inhibition Constant Data from BindingDB
Found 1 hit for monomerid = 50004496
Trg + Lig
Ki
nM
ΔG°
kcal/mole
IC50
nM
Kd
nM
EC50/IC50
nM
koff
s-1
kon
M-1s-1
pHTemp
°C
Phospholipase A2, major isoenzyme
(Sus scrofa (pig))
BDBM50004496
(CHEMBL318193 | Phosphoric acid mono-(2-hexadecanoy...)
Show SMILES CCCCCCCCCCCCCCCC(=O)N[C@@H](COP(O)(O)=O)CC(C)C
Show InChI InChI=1S/C22H46NO5P/c1-4-5-6-7-8-9-10-11-12-13-14-15-16-17-22(24)23-21(18-20(2)3)19-28-29(25,26)27/h20-21H,4-19H2,1-3H3,(H,23,24)(H2,25,26,27)/t21-/m1/s1
n/an/a 1.00E+4n/an/an/an/an/an/a
Fisons plc
Curated by ChEMBL
Assay Description
In vitro inhibition of porcine pancreatic phospholipase A2 evaluated by monomeric substrate assay
J Med Chem 35: 2939-51 (1992)
BindingDB Entry DOI: 10.7270/Q2RF5T0R