BDBM50005719 (APA)O-(3-Amino-propyl)-hydroxylamine::3-AMINOOXY-1-AMINOPROPANE::CHEMBL1209776::CHEMBL281021
SMILES: NCCCON
InChI Key: InChIKey=VSZFWDPIWSPZON-UHFFFAOYSA-N
Data: 2 IC50
PDB links: 3 PDB IDs match this monomer.
Activity Spreadsheet -- Enzyme Inhibition Constant Data from BindingDB
Found 2 hits for monomerid = 50005719
Trg + Lig
Ki
nM
ΔG°
kcal/mole
IC50
nM
Kd
nM
EC50/IC50
nM
koff
s-1
kon
M-1s-1
pHTemp
°C
Ornithine decarboxylase
(Rattus norvegicus)
BDBM50005719
((APA)O-(3-Amino-propyl)-hydroxylamine | 3-AMINOOXY...)
Show InChI InChI=1S/C3H10N2O/c4-2-1-3-6-5/h1-5H2
n/an/a 35n/an/an/an/an/an/a
University of Dundee
Curated by ChEMBL
Assay Description
Inhibition of rat liver ornithine decarboxylase
Bioorg Med Chem Lett 20: 4364-6 (2010)
Article DOI: 10.1016/j.bmcl.2010.06.070
BindingDB Entry DOI: 10.7270/Q2KS6RQM
3D
3D Structure (crystal)
Ornithine decarboxylase
(Rattus norvegicus)
BDBM50005719
((APA)O-(3-Amino-propyl)-hydroxylamine | 3-AMINOOXY...)
Show InChI InChI=1S/C3H10N2O/c4-2-1-3-6-5/h1-5H2
n/an/a 35n/an/an/an/an/an/a
Ciba-Geigy AG.
Curated by ChEMBL
Assay Description
Inhibitory activity against Rat liver ornithine decarboxylase(ODC)
J Med Chem 35: 1339-44 (1992)
BindingDB Entry DOI: 10.7270/Q24J0D27
3D
3D Structure (crystal)