BDBM50010930 2-{4-[(2,4-Diamino-pteridin-6-ylmethyl)-methyl-amino]-benzoylamino}-3-hydroxy-pentanedioic acid::CHEMBL307820
SMILES: CN(Cc1cnc2nc(N)nc(N)c2n1)c1ccc(cc1)C(=O)NC(C(O)CC(O)=O)C(O)=O
InChI Key: InChIKey=BBXRHFBLWJWOCL-UHFFFAOYSA-N
Data: 2 IC50
Activity Spreadsheet -- Enzyme Inhibition Constant Data from BindingDB
Found 2 hits for monomerid = 50010930
Trg + Lig
Ki
nM
ΔG°
kcal/mole
IC50
nM
Kd
nM
EC50/IC50
nM
koff
s-1
kon
M-1s-1
pHTemp
°C
Dihydrofolate reductase
(Homo sapiens (Human))
BDBM50010930
(2-{4-[(2,4-Diamino-pteridin-6-ylmethyl)-methyl-ami...)
Show SMILES CN(Cc1cnc2nc(N)nc(N)c2n1)c1ccc(cc1)C(=O)NC(C(O)CC(O)=O)C(O)=O
Show InChI InChI=1S/C20H22N8O6/c1-28(8-10-7-23-17-15(24-10)16(21)26-20(22)27-17)11-4-2-9(3-5-11)18(32)25-14(19(33)34)12(29)6-13(30)31/h2-5,7,12,14,29H,6,8H2,1H3,(H,25,32)(H,30,31)(H,33,34)(H4,21,22,23,26,27)
NCI pathway
Reactome pathway
n/an/a 5.30n/an/an/an/an/an/a
University of South Alabama
Curated by ChEMBL
Assay Description
Compound was tested for its inhibitory activity on Recombinant Human Dihydrofolate Reductase.
J Med Chem 34: 222-7 (1991)
BindingDB Entry DOI: 10.7270/Q2XD10N1
Folylpoly-gamma-glutamate synthetase
(Homo sapiens (Human))
BDBM50010930
(2-{4-[(2,4-Diamino-pteridin-6-ylmethyl)-methyl-ami...)
Show SMILES CN(Cc1cnc2nc(N)nc(N)c2n1)c1ccc(cc1)C(=O)NC(C(O)CC(O)=O)C(O)=O
Show InChI InChI=1S/C20H22N8O6/c1-28(8-10-7-23-17-15(24-10)16(21)26-20(22)27-17)11-4-2-9(3-5-11)18(32)25-14(19(33)34)12(29)6-13(30)31/h2-5,7,12,14,29H,6,8H2,1H3,(H,25,32)(H,30,31)(H,33,34)(H4,21,22,23,26,27)
Reactome pathway
n/an/a>2.00E+5n/an/an/an/an/an/a
University of South Alabama
Curated by ChEMBL
Assay Description
Compound was evaluated for the inhibition of Folyl-polyglutamate synthase in CCRF-CEM Human leukemia cell.
J Med Chem 34: 222-7 (1991)
BindingDB Entry DOI: 10.7270/Q2XD10N1