BDBM50015721 3-Hydroxy-2-phenyl-propionic acid 8-iminomethyl-8-aza-bicyclo[3.2.1]oct-3-yl ester; hydrochloride::CHEMBL553066
SMILES: OCC(C(=O)OC1CC2CCC(C1)N2C=N)c1ccccc1
InChI Key: InChIKey=VCUQNXOJJSWCPU-UHFFFAOYSA-N
Data: 3 Kd
Activity Spreadsheet -- Enzyme Inhibition Constant Data from BindingDB
Found 3 hits for monomerid = 50015721
Trg + Lig
Ki
nM
ΔG°
kcal/mole
IC50
nM
Kd
nM
EC50/IC50
nM
koff
s-1
kon
M-1s-1
pHTemp
°C
Muscarinic acetylcholine receptor M2
(RAT)
BDBM50015721
(3-Hydroxy-2-phenyl-propionic acid 8-iminomethyl-8-...)
Show SMILES OCC(C(=O)OC1CC2CCC(C1)N2C=N)c1ccccc1
Show InChI InChI=1S/C17H22N2O3/c18-11-19-13-6-7-14(19)9-15(8-13)22-17(21)16(10-20)12-4-2-1-3-5-12/h1-5,11,13-16,18,20H,6-10H2
Reactome pathway
n/an/an/a 1.60n/an/an/an/an/a
Istituto De Angeli
Curated by ChEMBL
Assay Description
In vitro receptor binding against Muscarinic acetylcholine receptor M2 in rat heart was determined using [3H]pirenzepine
J Med Chem 33: 2108-13 (1990)
BindingDB Entry DOI: 10.7270/Q2Z60PN5
Muscarinic acetylcholine receptor M3
(RAT)
BDBM50015721
(3-Hydroxy-2-phenyl-propionic acid 8-iminomethyl-8-...)
Show SMILES OCC(C(=O)OC1CC2CCC(C1)N2C=N)c1ccccc1
Show InChI InChI=1S/C17H22N2O3/c18-11-19-13-6-7-14(19)9-15(8-13)22-17(21)16(10-20)12-4-2-1-3-5-12/h1-5,11,13-16,18,20H,6-10H2
Reactome pathway
n/an/an/a 1.40n/an/an/an/an/a
Istituto De Angeli
Curated by ChEMBL
Assay Description
In vitro receptor binding against Muscarinic acetylcholine receptor M3 in rat submandibular gland was determined using [3H]pirenzepine
J Med Chem 33: 2108-13 (1990)
BindingDB Entry DOI: 10.7270/Q2Z60PN5
Muscarinic acetylcholine receptor M1
(RAT)
BDBM50015721
(3-Hydroxy-2-phenyl-propionic acid 8-iminomethyl-8-...)
Show SMILES OCC(C(=O)OC1CC2CCC(C1)N2C=N)c1ccccc1
Show InChI InChI=1S/C17H22N2O3/c18-11-19-13-6-7-14(19)9-15(8-13)22-17(21)16(10-20)12-4-2-1-3-5-12/h1-5,11,13-16,18,20H,6-10H2
Reactome pathway
n/an/an/a 1.10n/an/an/an/an/a
Istituto De Angeli
Curated by ChEMBL
Assay Description
In vitro receptor binding against Muscarinic acetylcholine receptor M1 in rat cerebral cortex was determined using [3H]pirenzepine
J Med Chem 33: 2108-13 (1990)
BindingDB Entry DOI: 10.7270/Q2Z60PN5