BDBM50016317 CHEMBL2371674::[Mpa1Val4MeAla7]AVP (Arginine-vasopressin )
SMILES: [#6]-[#6](-[#6])-[#6@H]-1-[#7]-[#6](=O)-[#6@H](-[#6]-c2ccccc2)-[#7]-[#6](=O)-[#6@@H](-[#6]-c2ccc(-[#8])cc2)-[#7]-[#6](=O)-[#6]-[#6]-[#16]-[#16]-[#6]-[#6@H](-[#7]-[#6](=O)-[#6@H](-[#6]-[#6](-[#7])=O)-[#7]-[#6]-1=O)-[#6](=O)-[#7](-[#6])-[#6@@H](-[#6])-[#6](=O)-[#7]-[#6@@H](-[#6]-[#6]-[#6]\[#7]=[#6](\[#7])-[#7])-[#6](=O)-[#7]-[#6]-[#6](-[#7])=O
InChI Key: InChIKey=FFHMMFXCDAAKNP-YWMPUGAXSA-N
Data: 4 Kd
Activity Spreadsheet -- Enzyme Inhibition Constant Data from BindingDB
Found 4 hits for monomerid = 50016317
Trg + Lig
Ki
nM
ΔG°
kcal/mole
IC50
nM
Kd
nM
EC50/IC50
nM
koff
s-1
kon
M-1s-1
pHTemp
°C
AVPR2
(BOVINE)
BDBM50016317
(CHEMBL2371674 | [Mpa1Val4MeAla7]AVP (Arginine-vaso...)
Show SMILES [#6]-[#6](-[#6])-[#6@H]-1-[#7]-[#6](=O)-[#6@H](-[#6]-c2ccccc2)-[#7]-[#6](=O)-[#6@@H](-[#6]-c2ccc(-[#8])cc2)-[#7]-[#6](=O)-[#6]-[#6]-[#16]-[#16]-[#6]-[#6@H](-[#7]-[#6](=O)-[#6@H](-[#6]-[#6](-[#7])=O)-[#7]-[#6]-1=O)-[#6](=O)-[#7](-[#6])-[#6@@H](-[#6])-[#6](=O)-[#7]-[#6@@H](-[#6]-[#6]-[#6]\[#7]=[#6](\[#7])-[#7])-[#6](=O)-[#7]-[#6]-[#6](-[#7])=O
Show InChI InChI=1S/C45H65N13O11S2/c1-24(2)37-43(68)55-32(21-34(46)60)41(66)56-33(44(69)58(4)25(3)38(63)53-29(11-8-17-50-45(48)49)39(64)51-22-35(47)61)23-71-70-18-16-36(62)52-30(20-27-12-14-28(59)15-13-27)40(65)54-31(42(67)57-37)19-26-9-6-5-7-10-26/h5-7,9-10,12-15,24-25,29-33,37,59H,8,11,16-23H2,1-4H3,(H2,46,60)(H2,47,61)(H,51,64)(H,52,62)(H,53,63)(H,54,65)(H,55,68)(H,56,66)(H,57,67)(H4,48,49,50)/t25-,29-,30+,31-,32-,33-,37+/m0/s1
Reactome pathway
n/an/an/a 8.5n/an/an/an/an/a
TBA
Curated by ChEMBL
Assay Description
Binding affinity against plasma membrane from bovine kidney inner medulla using [3H]-AVP as a radioligand
J Med Chem 29: 96-9 (1986)
BindingDB Entry DOI: 10.7270/Q2P849V1
Vasopressin V2 receptor
(BOVINE)
BDBM50016317
(CHEMBL2371674 | [Mpa1Val4MeAla7]AVP (Arginine-vaso...)
Show SMILES [#6]-[#6](-[#6])-[#6@H]-1-[#7]-[#6](=O)-[#6@H](-[#6]-c2ccccc2)-[#7]-[#6](=O)-[#6@@H](-[#6]-c2ccc(-[#8])cc2)-[#7]-[#6](=O)-[#6]-[#6]-[#16]-[#16]-[#6]-[#6@H](-[#7]-[#6](=O)-[#6@H](-[#6]-[#6](-[#7])=O)-[#7]-[#6]-1=O)-[#6](=O)-[#7](-[#6])-[#6@@H](-[#6])-[#6](=O)-[#7]-[#6@@H](-[#6]-[#6]-[#6]\[#7]=[#6](\[#7])-[#7])-[#6](=O)-[#7]-[#6]-[#6](-[#7])=O
Show InChI InChI=1S/C45H65N13O11S2/c1-24(2)37-43(68)55-32(21-34(46)60)41(66)56-33(44(69)58(4)25(3)38(63)53-29(11-8-17-50-45(48)49)39(64)51-22-35(47)61)23-71-70-18-16-36(62)52-30(20-27-12-14-28(59)15-13-27)40(65)54-31(42(67)57-37)19-26-9-6-5-7-10-26/h5-7,9-10,12-15,24-25,29-33,37,59H,8,11,16-23H2,1-4H3,(H2,46,60)(H2,47,61)(H,51,64)(H,52,62)(H,53,63)(H,54,65)(H,55,68)(H,56,66)(H,57,67)(H4,48,49,50)/t25-,29-,30+,31-,32-,33-,37+/m0/s1
Reactome pathway
n/an/an/a 9.40n/an/an/an/an/a
TBA
Curated by ChEMBL
Assay Description
Binding affinity against plasma membrane from bovine kidney inner medulla
J Med Chem 29: 96-9 (1986)
BindingDB Entry DOI: 10.7270/Q2P849V1
Vasopressin V1 receptor
(RAT)
BDBM50016317
(CHEMBL2371674 | [Mpa1Val4MeAla7]AVP (Arginine-vaso...)
Show SMILES [#6]-[#6](-[#6])-[#6@H]-1-[#7]-[#6](=O)-[#6@H](-[#6]-c2ccccc2)-[#7]-[#6](=O)-[#6@@H](-[#6]-c2ccc(-[#8])cc2)-[#7]-[#6](=O)-[#6]-[#6]-[#16]-[#16]-[#6]-[#6@H](-[#7]-[#6](=O)-[#6@H](-[#6]-[#6](-[#7])=O)-[#7]-[#6]-1=O)-[#6](=O)-[#7](-[#6])-[#6@@H](-[#6])-[#6](=O)-[#7]-[#6@@H](-[#6]-[#6]-[#6]\[#7]=[#6](\[#7])-[#7])-[#6](=O)-[#7]-[#6]-[#6](-[#7])=O
Show InChI InChI=1S/C45H65N13O11S2/c1-24(2)37-43(68)55-32(21-34(46)60)41(66)56-33(44(69)58(4)25(3)38(63)53-29(11-8-17-50-45(48)49)39(64)51-22-35(47)61)23-71-70-18-16-36(62)52-30(20-27-12-14-28(59)15-13-27)40(65)54-31(42(67)57-37)19-26-9-6-5-7-10-26/h5-7,9-10,12-15,24-25,29-33,37,59H,8,11,16-23H2,1-4H3,(H2,46,60)(H2,47,61)(H,51,64)(H,52,62)(H,53,63)(H,54,65)(H,55,68)(H,56,66)(H,57,67)(H4,48,49,50)/t25-,29-,30+,31-,32-,33-,37+/m0/s1
n/an/an/a 82n/an/an/an/an/a
TBA
Curated by ChEMBL
Assay Description
Binding affinity against plasma membrane from rat liver using [3H]-AVP as a radioligand
J Med Chem 29: 96-9 (1986)
BindingDB Entry DOI: 10.7270/Q2P849V1
Vasopressin V1 receptor
(RAT)
BDBM50016317
(CHEMBL2371674 | [Mpa1Val4MeAla7]AVP (Arginine-vaso...)
Show SMILES [#6]-[#6](-[#6])-[#6@H]-1-[#7]-[#6](=O)-[#6@H](-[#6]-c2ccccc2)-[#7]-[#6](=O)-[#6@@H](-[#6]-c2ccc(-[#8])cc2)-[#7]-[#6](=O)-[#6]-[#6]-[#16]-[#16]-[#6]-[#6@H](-[#7]-[#6](=O)-[#6@H](-[#6]-[#6](-[#7])=O)-[#7]-[#6]-1=O)-[#6](=O)-[#7](-[#6])-[#6@@H](-[#6])-[#6](=O)-[#7]-[#6@@H](-[#6]-[#6]-[#6]\[#7]=[#6](\[#7])-[#7])-[#6](=O)-[#7]-[#6]-[#6](-[#7])=O
Show InChI InChI=1S/C45H65N13O11S2/c1-24(2)37-43(68)55-32(21-34(46)60)41(66)56-33(44(69)58(4)25(3)38(63)53-29(11-8-17-50-45(48)49)39(64)51-22-35(47)61)23-71-70-18-16-36(62)52-30(20-27-12-14-28(59)15-13-27)40(65)54-31(42(67)57-37)19-26-9-6-5-7-10-26/h5-7,9-10,12-15,24-25,29-33,37,59H,8,11,16-23H2,1-4H3,(H2,46,60)(H2,47,61)(H,51,64)(H,52,62)(H,53,63)(H,54,65)(H,55,68)(H,56,66)(H,57,67)(H4,48,49,50)/t25-,29-,30+,31-,32-,33-,37+/m0/s1
n/an/an/a 53n/an/an/an/an/a
TBA
Curated by ChEMBL
Assay Description
Binding affinity against plasma membrane from rat liver
J Med Chem 29: 96-9 (1986)
BindingDB Entry DOI: 10.7270/Q2P849V1