BDBM50016660 2-{4-[2-(2-Amino-4-oxo-3,4,5,6,7,8-hexahydro-pteridin-6-yl)-ethylamino]-benzoylamino}-pentanedioic acid::CHEMBL23388
SMILES: Nc1nc2NC[C@H](CCNc3ccc(cc3)C(=O)NC(CCC(O)=O)C(O)=O)Nc2c(=O)[nH]1
InChI Key: InChIKey=SVEJTXIHPDUQLZ-UEWDXFNNSA-N
Data: 2 IC50
Activity Spreadsheet -- Enzyme Inhibition Constant Data from BindingDB
Found 2 hits for monomerid = 50016660
Trg + Lig
Ki
nM
ΔG°
kcal/mole
IC50
nM
Kd
nM
EC50/IC50
nM
koff
s-1
kon
M-1s-1
pHTemp
°C
GAR transformylase
(Mus musculus)
BDBM50016660
(2-{4-[2-(2-Amino-4-oxo-3,4,5,6,7,8-hexahydro-pteri...)
Show SMILES Nc1nc2NC[C@H](CCNc3ccc(cc3)C(=O)NC(CCC(O)=O)C(O)=O)Nc2c(=O)[nH]1
Show InChI InChI=1S/C20H25N7O6/c21-20-26-16-15(18(31)27-20)24-12(9-23-16)7-8-22-11-3-1-10(2-4-11)17(30)25-13(19(32)33)5-6-14(28)29/h1-4,12-13,22,24H,5-9H2,(H,25,30)(H,28,29)(H,32,33)(H4,21,23,26,27,31)/t12-,13?/m0/s1
n/an/a>2.00E+4n/an/an/an/an/an/a
University of South Alabama
Curated by ChEMBL
Assay Description
Inhibition of the GAR transformylase in L1210
J Med Chem 32: 1277-83 (1989)
BindingDB Entry DOI: 10.7270/Q20K27J9
Glycinamide ribonucleotide formyltransferase (GARFTase)
(Homo sapiens (Human))
BDBM50016660
(2-{4-[2-(2-Amino-4-oxo-3,4,5,6,7,8-hexahydro-pteri...)
Show SMILES Nc1nc2NC[C@H](CCNc3ccc(cc3)C(=O)NC(CCC(O)=O)C(O)=O)Nc2c(=O)[nH]1
Show InChI InChI=1S/C20H25N7O6/c21-20-26-16-15(18(31)27-20)24-12(9-23-16)7-8-22-11-3-1-10(2-4-11)17(30)25-13(19(32)33)5-6-14(28)29/h1-4,12-13,22,24H,5-9H2,(H,25,30)(H,28,29)(H,32,33)(H4,21,23,26,27,31)/t12-,13?/m0/s1
n/an/a 1.00E+3n/an/an/an/an/an/a
University of South Alabama
Curated by ChEMBL
Assay Description
Inhibition of the GAR transformylase in lactobacillus casei
J Med Chem 32: 1277-83 (1989)
BindingDB Entry DOI: 10.7270/Q20K27J9