BDBM50016766 2-[1-(2-Carboxy-2-hydroxy-ethylcarbamoyl)-2-phenyl-ethylamino]-3-phenyl-propionic acid::CHEMBL163635
SMILES: O[C@@H](CNC(=O)[C@H](Cc1ccccc1)N[C@@H](Cc1ccccc1)C(O)=O)C(O)=O
InChI Key: InChIKey=LPVIDWMPLXDLLH-BZSNNMDCSA-N
Data: 2 IC50
Activity Spreadsheet -- Enzyme Inhibition Constant Data from BindingDB
Found 2 hits for monomerid = 50016766
Trg + Lig
Ki
nM
ΔG°
kcal/mole
IC50
nM
Kd
nM
EC50/IC50
nM
koff
s-1
kon
M-1s-1
pHTemp
°C
Angiotensin-converting enzyme
(Rattus norvegicus)
BDBM50016766
(2-[1-(2-Carboxy-2-hydroxy-ethylcarbamoyl)-2-phenyl...)
Show SMILES O[C@@H](CNC(=O)[C@H](Cc1ccccc1)N[C@@H](Cc1ccccc1)C(O)=O)C(O)=O
Show InChI InChI=1S/C21H24N2O6/c24-18(21(28)29)13-22-19(25)16(11-14-7-3-1-4-8-14)23-17(20(26)27)12-15-9-5-2-6-10-15/h1-10,16-18,23-24H,11-13H2,(H,22,25)(H,26,27)(H,28,29)/t16-,17-,18-/m0/s1
n/an/a>1.00E+3n/an/an/an/an/an/a
Schering-Plough Research
Curated by ChEMBL
Assay Description
Compound was evaluated for the ability to inhibit Angiotensin I converting enzyme in rat
J Med Chem 32: 737-9 (1989)
BindingDB Entry DOI: 10.7270/Q2BV7FMF
Neprilysin
(Oryctolagus cuniculus (rabbit))
BDBM50016766
(2-[1-(2-Carboxy-2-hydroxy-ethylcarbamoyl)-2-phenyl...)
Show SMILES O[C@@H](CNC(=O)[C@H](Cc1ccccc1)N[C@@H](Cc1ccccc1)C(O)=O)C(O)=O
Show InChI InChI=1S/C21H24N2O6/c24-18(21(28)29)13-22-19(25)16(11-14-7-3-1-4-8-14)23-17(20(26)27)12-15-9-5-2-6-10-15/h1-10,16-18,23-24H,11-13H2,(H,22,25)(H,26,27)(H,28,29)/t16-,17-,18-/m0/s1
n/an/a 11n/an/an/an/an/an/a
Schering-Plough Research
Curated by ChEMBL
Assay Description
Compound was evaluated for the ability to inhibit neutral endopeptidase purified from rabbit kidney
J Med Chem 32: 737-9 (1989)
BindingDB Entry DOI: 10.7270/Q2BV7FMF