BDBM50022283 2-{4-[(2-Amino-4-hydroxy-5,6,7,8-tetrahydro-pteridin-6-ylmethyl)-prop-2-ynyl-amino]-benzoylamino}-pentanedioic acid::CHEMBL23784
SMILES: Nc1nc2NCC(CN(CC#C)c3ccc(cc3)C(=O)NC(CCC(O)=O)C(O)=O)Nc2c(=O)[nH]1
InChI Key: InChIKey=YVMRPFLZJYKUQD-UHFFFAOYSA-N
Data: 2 IC50
Activity Spreadsheet -- Enzyme Inhibition Constant Data from BindingDB
Found 2 hits for monomerid = 50022283
Trg + Lig
Ki
nM
ΔG°
kcal/mole
IC50
nM
Kd
nM
EC50/IC50
nM
koff
s-1
kon
M-1s-1
pHTemp
°C
Dihydrofolate reductase
(Lactobacillus casei)
BDBM50022283
(2-{4-[(2-Amino-4-hydroxy-5,6,7,8-tetrahydro-pterid...)
Show SMILES Nc1nc2NCC(CN(CC#C)c3ccc(cc3)C(=O)NC(CCC(O)=O)C(O)=O)Nc2c(=O)[nH]1
Show InChI InChI=1S/C22H25N7O6/c1-2-9-29(11-13-10-24-18-17(25-13)20(33)28-22(23)27-18)14-5-3-12(4-6-14)19(32)26-15(21(34)35)7-8-16(30)31/h1,3-6,13,15,25H,7-11H2,(H,26,32)(H,30,31)(H,34,35)(H4,23,24,27,28,33)
n/an/a>1.40E+5n/an/an/an/an/an/a
TBA
Curated by ChEMBL
Assay Description
Inhibitory activity against dihydrofolate reductase derived from Lactobacillus casei
J Med Chem 29: 1263-9 (1987)
BindingDB Entry DOI: 10.7270/Q2BG2PK6
Thymidylate Synthase (TS)
(Lactobacillus casei)
BDBM50022283
(2-{4-[(2-Amino-4-hydroxy-5,6,7,8-tetrahydro-pterid...)
Show SMILES Nc1nc2NCC(CN(CC#C)c3ccc(cc3)C(=O)NC(CCC(O)=O)C(O)=O)Nc2c(=O)[nH]1
Show InChI InChI=1S/C22H25N7O6/c1-2-9-29(11-13-10-24-18-17(25-13)20(33)28-22(23)27-18)14-5-3-12(4-6-14)19(32)26-15(21(34)35)7-8-16(30)31/h1,3-6,13,15,25H,7-11H2,(H,26,32)(H,30,31)(H,34,35)(H4,23,24,27,28,33)
n/an/a 3.20E+5n/an/an/an/an/an/a
TBA
Curated by ChEMBL
Assay Description
Inhibitory activity against thymidylate synthase derived from Lactobacillus casei
J Med Chem 29: 1263-9 (1987)
BindingDB Entry DOI: 10.7270/Q2BG2PK6