null
SMILES: COc1cc2ccccc2cc1C(=O)C(=N/C1CCCC1)\n1ncc(C#N)c1N
InChI Key: InChIKey=ZZCDYTWZLMGMNU-XTCLZLMSSA-N
Activity Spreadsheet -- Enzyme Inhibition Constant Data from BindingDB
Found 1 hit for monomerid = 50023471
Trg + Lig
Ki
nM
ΔG°
kcal/mole
IC50
nM
Kd
nM
EC50/IC50
nM
koff
s-1
kon
M-1s-1
pHTemp
°C
Lysophosphatidic acid receptor 1
(Homo sapiens (Human))
BDBM50023471
(CHEMBL3326531)
Show SMILES COc1cc2ccccc2cc1C(=O)C(=N/C1CCCC1)\n1ncc(C#N)c1N
Show InChI InChI=1S/C22H21N5O2/c1-29-19-11-15-7-3-2-6-14(15)10-18(19)20(28)22(26-17-8-4-5-9-17)27-21(24)16(12-23)13-25-27/h2-3,6-7,10-11,13,17H,4-5,8-9,24H2,1H3/b26-22+
n/an/a 805n/an/an/an/an/an/a
Hoffmann-La Roche Inc.
Curated by ChEMBL
Assay Description
Antagonist activity at human LPA1R expressed in Chem-1 cells assessed as inhibition of lysophosphatidic acid-induced calcium mobilization by FLIPR as...
Bioorg Med Chem Lett 24: 4450-4 (2014)
Article DOI: 10.1016/j.bmcl.2014.08.001
BindingDB Entry DOI: 10.7270/Q2445P1V