BDBM50031866 6-(((3-chlorophenyl)(methyl)amino)methyl)pyrido[3,2-d]pyrimidine-2,4-diamine::6-{[(3-Chloro-phenyl)-methyl-amino]-methyl}-pyrido[3,2-d]pyrimidine-2,4-diamine::CHEMBL54399
SMILES: CN(Cc1ccc2nc(N)nc(N)c2n1)c1cccc(Cl)c1
InChI Key: InChIKey=YGMFWJRAPSYNFQ-UHFFFAOYSA-N
Data: 6 IC50
Activity Spreadsheet -- Enzyme Inhibition Constant Data from BindingDB
Found 6 hits for monomerid = 50031866
Trg + Lig
Ki
nM
ΔG°
kcal/mole
IC50
nM
Kd
nM
EC50/IC50
nM
koff
s-1
kon
M-1s-1
pHTemp
°C
Dihydrofolate Reductase (DHFR)
(Pneumocystis carinii)
BDBM50031866
(6-(((3-chlorophenyl)(methyl)amino)methyl)pyrido[3,...)
Show SMILES CN(Cc1ccc2nc(N)nc(N)c2n1)c1cccc(Cl)c1
Show InChI InChI=1S/C15H15ClN6/c1-22(11-4-2-3-9(16)7-11)8-10-5-6-12-13(19-10)14(17)21-15(18)20-12/h2-7H,8H2,1H3,(H4,17,18,20,21)
n/an/a 2.10E+3n/an/an/an/an/an/a
Institute
Curated by ChEMBL
Assay Description
Concentration inhibiting P. carinii dihydrofolate reductase
J Med Chem 38: 2615-20 (1995)
BindingDB Entry DOI: 10.7270/Q2736PXG
Dihydrofolate reductase (DHFR)
(Toxoplasma gondii)
BDBM50031866
(6-(((3-chlorophenyl)(methyl)amino)methyl)pyrido[3,...)
Show SMILES CN(Cc1ccc2nc(N)nc(N)c2n1)c1cccc(Cl)c1
Show InChI InChI=1S/C15H15ClN6/c1-22(11-4-2-3-9(16)7-11)8-10-5-6-12-13(19-10)14(17)21-15(18)20-12/h2-7H,8H2,1H3,(H4,17,18,20,21)
n/an/a 20n/an/an/an/an/an/a
Institute
Curated by ChEMBL
Assay Description
Concentration inhibiting T. gondii dihydrofolate reductase
J Med Chem 38: 2615-20 (1995)
BindingDB Entry DOI: 10.7270/Q2736PXG
Dihydrofolate reductase
(Rattus norvegicus (rat))
BDBM50031866
(6-(((3-chlorophenyl)(methyl)amino)methyl)pyrido[3,...)
Show SMILES CN(Cc1ccc2nc(N)nc(N)c2n1)c1cccc(Cl)c1
Show InChI InChI=1S/C15H15ClN6/c1-22(11-4-2-3-9(16)7-11)8-10-5-6-12-13(19-10)14(17)21-15(18)20-12/h2-7H,8H2,1H3,(H4,17,18,20,21)
Reactome pathway
n/an/a 67n/an/an/an/an/an/a
Duquesne University
Curated by ChEMBL
Assay Description
Inhibitory activity against rat liver dihydrofolate reductase.
J Med Chem 39: 1836-45 (1996)
Article DOI: 10.1021/jm950918e
BindingDB Entry DOI: 10.7270/Q2319TXB
Dihydrofolate reductase
(Saccharomyces cerevisiae)
BDBM50031866
(6-(((3-chlorophenyl)(methyl)amino)methyl)pyrido[3,...)
Show SMILES CN(Cc1ccc2nc(N)nc(N)c2n1)c1cccc(Cl)c1
Show InChI InChI=1S/C15H15ClN6/c1-22(11-4-2-3-9(16)7-11)8-10-5-6-12-13(19-10)14(17)21-15(18)20-12/h2-7H,8H2,1H3,(H4,17,18,20,21)
Reactome pathway
n/an/a 2.10E+3n/an/an/an/an/an/a
Duquesne University
Curated by ChEMBL
Assay Description
Inhibitory activity against Pneumocystis carinii dihydrofolate reductase.
J Med Chem 39: 1836-45 (1996)
Article DOI: 10.1021/jm950918e
BindingDB Entry DOI: 10.7270/Q2319TXB
Dihydrofolate reductase (DHFR)
(Toxoplasma gondii)
BDBM50031866
(6-(((3-chlorophenyl)(methyl)amino)methyl)pyrido[3,...)
Show SMILES CN(Cc1ccc2nc(N)nc(N)c2n1)c1cccc(Cl)c1
Show InChI InChI=1S/C15H15ClN6/c1-22(11-4-2-3-9(16)7-11)8-10-5-6-12-13(19-10)14(17)21-15(18)20-12/h2-7H,8H2,1H3,(H4,17,18,20,21)
n/an/a 20n/an/an/an/an/an/a
Duquesne University
Curated by ChEMBL
Assay Description
Inhibitory activity against Toxoplasma gondii dihydrofolate reductase.
J Med Chem 39: 1836-45 (1996)
Article DOI: 10.1021/jm950918e
BindingDB Entry DOI: 10.7270/Q2319TXB
Dihydrofolate reductase
(Rattus norvegicus (rat))
BDBM50031866
(6-(((3-chlorophenyl)(methyl)amino)methyl)pyrido[3,...)
Show SMILES CN(Cc1ccc2nc(N)nc(N)c2n1)c1cccc(Cl)c1
Show InChI InChI=1S/C15H15ClN6/c1-22(11-4-2-3-9(16)7-11)8-10-5-6-12-13(19-10)14(17)21-15(18)20-12/h2-7H,8H2,1H3,(H4,17,18,20,21)
Reactome pathway
n/an/a 67n/an/an/an/an/an/a
Institute
Curated by ChEMBL
Assay Description
Concentration inhibiting rat liver dihydrofolate reductase .
J Med Chem 38: 2615-20 (1995)
BindingDB Entry DOI: 10.7270/Q2736PXG