BDBM50045626 CHEMBL3314306::US9540323, 201::US9540323, example 201
SMILES: Cc1nc(NC(=O)Nc2ccccc2N2CC(C)(C)c3c2c(O)ccc3-c2ccc(F)cc2)cs1
InChI Key: InChIKey=GMWZMNUBSYYVDA-UHFFFAOYSA-N
Data: 1 KI  2 IC50
Activity Spreadsheet -- Enzyme Inhibition Constant Data from BindingDB
Found 3 hits for monomerid = 50045626
Trg + Lig
Ki
nM
ΔG°
kcal/mole
IC50
nM
Kd
nM
EC50/IC50
nM
koff
s-1
kon
M-1s-1
pHTemp
°C
P2Y purinoceptor 1
(Homo sapiens (Human))
BDBM50045626
(CHEMBL3314306 | US9540323, 201 | US9540323, exampl...)
Show SMILES Cc1nc(NC(=O)Nc2ccccc2N2CC(C)(C)c3c2c(O)ccc3-c2ccc(F)cc2)cs1
Show InChI InChI=1S/C27H25FN4O2S/c1-16-29-23(14-35-16)31-26(34)30-20-6-4-5-7-21(20)32-15-27(2,3)24-19(12-13-22(33)25(24)32)17-8-10-18(28)11-9-17/h4-14,33H,15H2,1-3H3,(H2,30,31,34)
US Patent
5.80 -11.2n/an/an/an/an/a7.425
Bristol-Myers Squibb Company
US Patent
Assay Description
A SPA membrane binding assay was used to identify inhibitors of [33P] 2MeS-ADP binding to cloned human P2Y1 receptors (The P2Y1 receptor membranes we...
US Patent US9540323 (2017)
BindingDB Entry DOI: 10.7270/Q289141P
P2Y purinoceptor 1
(Homo sapiens (Human))
BDBM50045626
(CHEMBL3314306 | US9540323, 201 | US9540323, exampl...)
Show SMILES Cc1nc(NC(=O)Nc2ccccc2N2CC(C)(C)c3c2c(O)ccc3-c2ccc(F)cc2)cs1
Show InChI InChI=1S/C27H25FN4O2S/c1-16-29-23(14-35-16)31-26(34)30-20-6-4-5-7-21(20)32-15-27(2,3)24-19(12-13-22(33)25(24)32)17-8-10-18(28)11-9-17/h4-14,33H,15H2,1-3H3,(H2,30,31,34)
n/an/a 430n/an/an/an/an/an/a
Bristol-Myers Squibb Research
Curated by ChEMBL
Assay Description
Antagonist activity at P2Y1 receptor in platelet-enriched human plasma assessed as 10 uM ADP-induced platelet aggregation preincubated for 1 min foll...
J Med Chem 57: 6150-64 (2014)
Article DOI: 10.1021/jm5006226
BindingDB Entry DOI: 10.7270/Q20Z74XP
P2Y purinoceptor 1
(Homo sapiens (Human))
BDBM50045626
(CHEMBL3314306 | US9540323, 201 | US9540323, exampl...)
Show SMILES Cc1nc(NC(=O)Nc2ccccc2N2CC(C)(C)c3c2c(O)ccc3-c2ccc(F)cc2)cs1
Show InChI InChI=1S/C27H25FN4O2S/c1-16-29-23(14-35-16)31-26(34)30-20-6-4-5-7-21(20)32-15-27(2,3)24-19(12-13-22(33)25(24)32)17-8-10-18(28)11-9-17/h4-14,33H,15H2,1-3H3,(H2,30,31,34)
n/an/a 0.0800n/an/an/an/an/an/a
Bristol-Myers Squibb Research
Curated by ChEMBL
Assay Description
Antagonist activity at P2Y1 receptor in washed human platelets assessed as 1 uM 2-methylthio-ADP-induced calcium flux by FLIPR assay
J Med Chem 57: 6150-64 (2014)
Article DOI: 10.1021/jm5006226
BindingDB Entry DOI: 10.7270/Q20Z74XP