BDBM50050757 CHEMBL3317978
SMILES: N[C@H]1CCCC[C@@H]1Nc1nc(ncc1F)-c1c[nH]c2ncc(Cl)cc12
InChI Key: InChIKey=SULNOIBYGOBLSZ-KBPBESRZSA-N
Data: 1 Kd
Activity Spreadsheet -- Enzyme Inhibition Constant Data from BindingDB
Found 1 hit for monomerid = 50050757
Trg + Lig
Ki
nM
ΔG°
kcal/mole
IC50
nM
Kd
nM
EC50/IC50
nM
koff
s-1
kon
M-1s-1
pHTemp
°C
Polymerase basic protein 2
(Influenza A virus (strain A/Puerto Rico/8/1934 H1N...)
BDBM50050757
(CHEMBL3317978)
Show SMILES N[C@H]1CCCC[C@@H]1Nc1nc(ncc1F)-c1c[nH]c2ncc(Cl)cc12 |r|
Show InChI InChI=1S/C17H18ClFN6/c18-9-5-10-11(7-22-15(10)21-6-9)16-23-8-12(19)17(25-16)24-14-4-2-1-3-13(14)20/h5-8,13-14H,1-4,20H2,(H,21,22)(H,23,24,25)/t13-,14-/m0/s1
n/an/an/a 90n/an/an/an/an/a
Vertex Pharmaceuticals Inc.
Curated by ChEMBL
Assay Description
Binding affinity to influenza A virus (A/Puerto Rico/8/1934(H1N1)) PB2 by competition binding fluorescence polarization (FP) assay
J Med Chem 57: 6668-78 (2014)
Article DOI: 10.1021/jm5007275
BindingDB Entry DOI: 10.7270/Q2R21316