BDBM50051804 (2S,5R)-1-[2-((S)-2-Mercapto-3-phenyl-propionylamino)-acetyl]-5-m-tolyl-pyrrolidine-2-carboxylic acid::CHEMBL427760
SMILES: Cc1cccc(c1)[C@H]1CC[C@H](N1C(=O)CNC(=O)[C@@H](S)Cc1ccccc1)C(O)=O
InChI Key: InChIKey=MUUFSQHEJSEUOA-AABGKKOBSA-N
Data: 2 IC50
Activity Spreadsheet -- Enzyme Inhibition Constant Data from BindingDB
Found 2 hits for monomerid = 50051804
Trg + Lig
Ki
nM
ΔG°
kcal/mole
IC50
nM
Kd
nM
EC50/IC50
nM
koff
s-1
kon
M-1s-1
pHTemp
°C
Neprilysin
(Oryctolagus cuniculus (rabbit))
BDBM50051804
((2S,5R)-1-[2-((S)-2-Mercapto-3-phenyl-propionylami...)
Show SMILES Cc1cccc(c1)[C@H]1CC[C@H](N1C(=O)CNC(=O)[C@@H](S)Cc1ccccc1)C(O)=O
Show InChI InChI=1S/C23H26N2O4S/c1-15-6-5-9-17(12-15)18-10-11-19(23(28)29)25(18)21(26)14-24-22(27)20(30)13-16-7-3-2-4-8-16/h2-9,12,18-20,30H,10-11,13-14H2,1H3,(H,24,27)(H,28,29)/t18-,19+,20+/m1/s1
n/an/a 2.30n/an/an/an/an/an/a
INSERM
Curated by ChEMBL
Assay Description
In vitro inhibition of neutral endopeptidase
J Med Chem 39: 2594-608 (1996)
Article DOI: 10.1021/jm950783c
BindingDB Entry DOI: 10.7270/Q25B0353
Angiotensin-converting enzyme
(Rattus norvegicus)
BDBM50051804
((2S,5R)-1-[2-((S)-2-Mercapto-3-phenyl-propionylami...)
Show SMILES Cc1cccc(c1)[C@H]1CC[C@H](N1C(=O)CNC(=O)[C@@H](S)Cc1ccccc1)C(O)=O
Show InChI InChI=1S/C23H26N2O4S/c1-15-6-5-9-17(12-15)18-10-11-19(23(28)29)25(18)21(26)14-24-22(27)20(30)13-16-7-3-2-4-8-16/h2-9,12,18-20,30H,10-11,13-14H2,1H3,(H,24,27)(H,28,29)/t18-,19+,20+/m1/s1
n/an/a 6.20n/an/an/an/an/an/a
INSERM
Curated by ChEMBL
Assay Description
In vitro inhibition of rat angiotensin I converting enzyme
J Med Chem 39: 2594-608 (1996)
Article DOI: 10.1021/jm950783c
BindingDB Entry DOI: 10.7270/Q25B0353