BDBM50065209 (3Z)-1-azabicyclo[2.2.1]heptan-3-oneO-[(2E)-pent-2-en-4-ynyl]oxime::1-Aza-bicyclo[2.2.1]heptan-3-one O-pent-2-en-4-ynyl-oxime::CHEMBL312823
SMILES: C#C\C=C\CO\N=C1/CN2CCC1C2
InChI Key: InChIKey=PNGMPCNVGUFXDA-NEVCXRMESA-N
Data: 5 IC50
Activity Spreadsheet -- Enzyme Inhibition Constant Data from BindingDB
Found 5 hits for monomerid = 50065209
Trg + Lig
Ki
nM
ΔG°
kcal/mole
IC50
nM
Kd
nM
EC50/IC50
nM
koff
s-1
kon
M-1s-1
pHTemp
°C
Muscarinic acetylcholine receptor M1
(Homo sapiens (Human))
BDBM50065209
((3Z)-1-azabicyclo[2.2.1]heptan-3-oneO-[(2E)-pent-2...)
Show SMILES C#C\C=C\CO\N=C1/CN2CCC1C2
Show InChI InChI=1S/C11H14N2O/c1-2-3-4-7-14-12-11-9-13-6-5-10(11)8-13/h1,3-4,10H,5-9H2/b4-3+,12-11+
n/an/a 216n/an/an/an/an/an/a
Warner-Lambert Company
Curated by ChEMBL
Assay Description
Binding affinity of [3H]-QNB to CHO cells expressing human Muscarinic acetylcholine receptor M1
J Med Chem 41: 2524-36 (1998)
Article DOI: 10.1021/jm960683m
BindingDB Entry DOI: 10.7270/Q2VD6XKK
Muscarinic acetylcholine receptor M2
(Homo sapiens (Human))
BDBM50065209
((3Z)-1-azabicyclo[2.2.1]heptan-3-oneO-[(2E)-pent-2...)
Show SMILES C#C\C=C\CO\N=C1/CN2CCC1C2
Show InChI InChI=1S/C11H14N2O/c1-2-3-4-7-14-12-11-9-13-6-5-10(11)8-13/h1,3-4,10H,5-9H2/b4-3+,12-11+
n/an/a 519n/an/an/an/an/an/a
Warner-Lambert Company
Curated by ChEMBL
Assay Description
Binding affinity of [3H]-QNB to CHO cells expressing human Muscarinic acetylcholine receptor M2
J Med Chem 41: 2524-36 (1998)
Article DOI: 10.1021/jm960683m
BindingDB Entry DOI: 10.7270/Q2VD6XKK
Muscarinic acetylcholine receptor
(RAT)
BDBM50065209
((3Z)-1-azabicyclo[2.2.1]heptan-3-oneO-[(2E)-pent-2...)
Show SMILES C#C\C=C\CO\N=C1/CN2CCC1C2
Show InChI InChI=1S/C11H14N2O/c1-2-3-4-7-14-12-11-9-13-6-5-10(11)8-13/h1,3-4,10H,5-9H2/b4-3+,12-11+
NCI pathway
Reactome pathway
n/an/a 35n/an/an/an/an/an/a
TBA
Curated by ChEMBL
Assay Description
Inhibitory activity against human Muscarinic acetylcholine receptor M1 using [3H]-quinuclidinyl benzilate to label antagonist site (RQNB) in CHO cell...
Bioorg Med Chem Lett 2: 821-826 (1992)
Article DOI: 10.1016/S0960-894X(00)80538-7
BindingDB Entry DOI: 10.7270/Q2PG1RNN
Muscarinic acetylcholine receptor M1
(Homo sapiens (Human))
BDBM50065209
((3Z)-1-azabicyclo[2.2.1]heptan-3-oneO-[(2E)-pent-2...)
Show SMILES C#C\C=C\CO\N=C1/CN2CCC1C2
Show InChI InChI=1S/C11H14N2O/c1-2-3-4-7-14-12-11-9-13-6-5-10(11)8-13/h1,3-4,10H,5-9H2/b4-3+,12-11+
n/an/a 1.26E+4n/an/an/an/an/an/a
TBA
Curated by ChEMBL
Assay Description
Inhibitory activity against human Muscarinic acetylcholine receptor M1 using [3H]-quinuclidinyl benzilate to label antagonist site (RQNB) in CHO cell...
Bioorg Med Chem Lett 2: 821-826 (1992)
Article DOI: 10.1016/S0960-894X(00)80538-7
BindingDB Entry DOI: 10.7270/Q2PG1RNN
Muscarinic acetylcholine receptor M2
(Homo sapiens (Human))
BDBM50065209
((3Z)-1-azabicyclo[2.2.1]heptan-3-oneO-[(2E)-pent-2...)
Show SMILES C#C\C=C\CO\N=C1/CN2CCC1C2
Show InChI InChI=1S/C11H14N2O/c1-2-3-4-7-14-12-11-9-13-6-5-10(11)8-13/h1,3-4,10H,5-9H2/b4-3+,12-11+
n/an/a 3.02E+4n/an/an/an/an/an/a
TBA
Curated by ChEMBL
Assay Description
Inhibitory activity against human Muscarinic acetylcholine receptor M2 using [3H]-quinuclidinyl benzilate to label antagonist site (RQNB) in CHO cell...
Bioorg Med Chem Lett 2: 821-826 (1992)
Article DOI: 10.1016/S0960-894X(00)80538-7
BindingDB Entry DOI: 10.7270/Q2PG1RNN