null
SMILES: Fc1cccc(c1)C#CCO\N=C1/CN2CCC1C2
InChI Key: InChIKey=IGNCXXVRIFRQNM-BMRADRMJSA-N
Activity Spreadsheet -- Enzyme Inhibition Constant Data from BindingDB
Found 4 hits for monomerid = 50065222
Trg + Lig
Ki
nM
ΔG°
kcal/mole
IC50
nM
Kd
nM
EC50/IC50
nM
koff
s-1
kon
M-1s-1
pHTemp
°C
Muscarinic acetylcholine receptor M2
(Homo sapiens (Human))
BDBM50065222
(1-Aza-bicyclo[2.2.1]heptan-3-one O-[3-(3-fluoro-ph...)
Show SMILES Fc1cccc(c1)C#CCO\N=C1/CN2CCC1C2
Show InChI InChI=1S/C15H15FN2O/c16-14-5-1-3-12(9-14)4-2-8-19-17-15-11-18-7-6-13(15)10-18/h1,3,5,9,13H,6-8,10-11H2/b17-15+
n/an/a 4.79E+4n/an/an/an/an/an/a
Warner-Lambert Company
Curated by ChEMBL
Assay Description
Binding affinity of [3H]-QNB to CHO cells expressing human Muscarinic acetylcholine receptor M2
J Med Chem 41: 2524-36 (1998)
Article DOI: 10.1021/jm960683m
BindingDB Entry DOI: 10.7270/Q2VD6XKK
Muscarinic acetylcholine receptor M1/M2/M3/M4/M5
(RAT)
BDBM50065222
(1-Aza-bicyclo[2.2.1]heptan-3-one O-[3-(3-fluoro-ph...)
Show SMILES Fc1cccc(c1)C#CCO\N=C1/CN2CCC1C2
Show InChI InChI=1S/C15H15FN2O/c16-14-5-1-3-12(9-14)4-2-8-19-17-15-11-18-7-6-13(15)10-18/h1,3,5,9,13H,6-8,10-11H2/b17-15+
NCI pathway
Reactome pathway
n/an/a 4.93E+3n/an/an/an/an/an/a
TBA
Assay Description
Binding affinity towards muscarinic receptor using [3H]quinuclidinyl benzilate (QNB) to label antagonist sites in membrane preparations from rat neoc...
Citation and Details
BindingDB Entry DOI: 10.7270/Q2736T2X
Muscarinic acetylcholine receptor M1/M2/M3/M4/M5
(RAT)
BDBM50065222
(1-Aza-bicyclo[2.2.1]heptan-3-one O-[3-(3-fluoro-ph...)
Show SMILES Fc1cccc(c1)C#CCO\N=C1/CN2CCC1C2
Show InChI InChI=1S/C15H15FN2O/c16-14-5-1-3-12(9-14)4-2-8-19-17-15-11-18-7-6-13(15)10-18/h1,3,5,9,13H,6-8,10-11H2/b17-15+
NCI pathway
Reactome pathway
n/an/a 37n/an/an/an/an/an/a
TBA
Assay Description
Binding affinity towards muscarinic receptor using [3H]cis-methyldioxolane (CMD) to label agonist sites in membrane preparations from rat neocortex
Citation and Details
BindingDB Entry DOI: 10.7270/Q2736T2X
Muscarinic acetylcholine receptor M1
(Homo sapiens (Human))
BDBM50065222
(1-Aza-bicyclo[2.2.1]heptan-3-one O-[3-(3-fluoro-ph...)
Show SMILES Fc1cccc(c1)C#CCO\N=C1/CN2CCC1C2
Show InChI InChI=1S/C15H15FN2O/c16-14-5-1-3-12(9-14)4-2-8-19-17-15-11-18-7-6-13(15)10-18/h1,3,5,9,13H,6-8,10-11H2/b17-15+
n/an/a 9.85E+3n/an/an/an/an/an/a
Warner-Lambert Company
Curated by ChEMBL
Assay Description
Binding affinity of [3H]-QNB to CHO cells expressing human Muscarinic acetylcholine receptor M1
J Med Chem 41: 2524-36 (1998)
Article DOI: 10.1021/jm960683m
BindingDB Entry DOI: 10.7270/Q2VD6XKK