BDBM50067353 CHEMBL3401792
SMILES: CCCCCCCCCCCC(=O)N[C@@H](CO)C[C@H](O)c1ccccc1
InChI Key: InChIKey=YCAKBKAOFSILDC-RTWAWAEBSA-N
Data: 1 EC50
Activity Spreadsheet -- Enzyme Inhibition Constant Data from BindingDB
Found 1 hit for monomerid = 50067353
Trg + Lig
Ki
nM
ΔG°
kcal/mole
IC50
nM
Kd
nM
EC50/IC50
nM
koff
s-1
kon
M-1s-1
pHTemp
°C
Collagen type IV alpha-3-binding protein
(Homo sapiens (Human))
BDBM50067353
(CHEMBL3401792)
Show SMILES CCCCCCCCCCCC(=O)N[C@@H](CO)C[C@H](O)c1ccccc1 |r|
Show InChI InChI=1S/C22H37NO3/c1-2-3-4-5-6-7-8-9-13-16-22(26)23-20(18-24)17-21(25)19-14-11-10-12-15-19/h10-12,14-15,20-21,24-25H,2-9,13,16-18H2,1H3,(H,23,26)/t20-,21+/m1/s1
n/an/an/an/a 4.00E+3n/an/an/an/a
Universit£ Paul Sabatier-Toulouse III
Curated by ChEMBL
Assay Description
Binding affinity to histidine-tagged human recombinant COL4A3ABP containing CERT START domain pre-incubated for 30 mins before biotinylated ceramide ...
Bioorg Med Chem 23: 2004-9 (2015)
Article DOI: 10.1016/j.bmc.2015.03.019
BindingDB Entry DOI: 10.7270/Q2GT5PVM