BDBM50078324 CHEMBL3414708::US9260455, 8
SMILES: [H][C@]12CSC(N)=N[C@]1(CO[C@@H](COC)C2)c1ccc(F)cc1F
InChI Key: InChIKey=AVYXEHSYNNACNZ-ISOBSLSZSA-N
Data: 6 IC50
Activity Spreadsheet -- Enzyme Inhibition Constant Data from BindingDB
Found 6 hits for monomerid = 50078324
Trg + Lig
Ki
nM
ΔG°
kcal/mole
IC50
nM
Kd
nM
EC50/IC50
nM
koff
s-1
kon
M-1s-1
pHTemp
°C
Beta-secretase 1 (BACE1)
(Homo sapiens (Human))
BDBM50078324
(CHEMBL3414708 | US9260455, 8)
Show SMILES [H][C@]12CSC(N)=N[C@]1(CO[C@@H](COC)C2)c1ccc(F)cc1F |r,c:5|
Show InChI InChI=1S/C15H18F2N2O2S/c1-20-6-11-4-9-7-22-14(18)19-15(9,8-21-11)12-3-2-10(16)5-13(12)17/h2-3,5,9,11H,4,6-8H2,1H3,(H2,18,19)/t9-,11+,15-/m0/s1
US Patent
n/an/a 855n/an/an/an/a4.537
Pfizer Inc.
US Patent
Assay Description
A synthetic APP substrate that can be cleaved by beta-secretase having N-terminal biotin and made fluorescent by the covalent attachment of Oregon Gr...
US Patent US9260455 (2016)
BindingDB Entry DOI: 10.7270/Q2GB22WN
Beta-secretase 2
(Homo sapiens (Human))
BDBM50078324
(CHEMBL3414708 | US9260455, 8)
Show SMILES [H][C@]12CSC(N)=N[C@]1(CO[C@@H](COC)C2)c1ccc(F)cc1F |r,c:5|
Show InChI InChI=1S/C15H18F2N2O2S/c1-20-6-11-4-9-7-22-14(18)19-15(9,8-21-11)12-3-2-10(16)5-13(12)17/h2-3,5,9,11H,4,6-8H2,1H3,(H2,18,19)/t9-,11+,15-/m0/s1
US Patent
n/an/a 1.63E+3n/an/an/an/a4.537
Pfizer Inc.
US Patent
Assay Description
This assay measures the inhibition of the BACE2 enzyme as it cleaves a non-native peptide. A synthetic substrate that can be cleaved by BACE2 having ...
US Patent US9260455 (2016)
BindingDB Entry DOI: 10.7270/Q2GB22WN
Beta-secretase 1
(Homo sapiens (Human))
BDBM50078324
(CHEMBL3414708 | US9260455, 8)
Show SMILES [H][C@]12CSC(N)=N[C@]1(CO[C@@H](COC)C2)c1ccc(F)cc1F |r,c:5|
Show InChI InChI=1S/C15H18F2N2O2S/c1-20-6-11-4-9-7-22-14(18)19-15(9,8-21-11)12-3-2-10(16)5-13(12)17/h2-3,5,9,11H,4,6-8H2,1H3,(H2,18,19)/t9-,11+,15-/m0/s1
n/an/a 855n/an/an/an/an/an/a
The Scripps Research Institute
Curated by ChEMBL
Assay Description
Inhibition of BACE1 in human H4 cells overexpressing wild type human APP695 assessed as colorimetric reaction by Whole cell assay
J Med Chem 58: 3223-52 (2015)
Article DOI: 10.1021/acs.jmedchem.5b00191
BindingDB Entry DOI: 10.7270/Q29W0H68
Cathepsin D
(Homo sapiens (Human))
BDBM50078324
(CHEMBL3414708 | US9260455, 8)
Show SMILES [H][C@]12CSC(N)=N[C@]1(CO[C@@H](COC)C2)c1ccc(F)cc1F |r,c:5|
Show InChI InChI=1S/C15H18F2N2O2S/c1-20-6-11-4-9-7-22-14(18)19-15(9,8-21-11)12-3-2-10(16)5-13(12)17/h2-3,5,9,11H,4,6-8H2,1H3,(H2,18,19)/t9-,11+,15-/m0/s1
NCI pathway
Reactome pathway
n/an/a>9.14E+4n/an/an/an/an/an/a
Eurofarma Laboratorios S.A.
Curated by ChEMBL
Assay Description
Inhibition of CatD (unknown origin) by fluorescence polarization assay
J Med Chem 58: 2678-702 (2015)
Article DOI: 10.1021/jm501833t
BindingDB Entry DOI: 10.7270/Q2W37Z1D
Beta-secretase 1
(Homo sapiens (Human))
BDBM50078324
(CHEMBL3414708 | US9260455, 8)
Show SMILES [H][C@]12CSC(N)=N[C@]1(CO[C@@H](COC)C2)c1ccc(F)cc1F |r,c:5|
Show InChI InChI=1S/C15H18F2N2O2S/c1-20-6-11-4-9-7-22-14(18)19-15(9,8-21-11)12-3-2-10(16)5-13(12)17/h2-3,5,9,11H,4,6-8H2,1H3,(H2,18,19)/t9-,11+,15-/m0/s1
n/an/a 850n/an/an/an/an/an/a
Eurofarma Laboratorios S.A.
Curated by ChEMBL
Assay Description
Inhibition of BACE1 (unknown origin) using biotin-GLTNIKTEEISEISYEVEFR-C[Oregon Green]KK-OH as substrate after 3 hrs by fluorescence polarization ass...
J Med Chem 58: 2678-702 (2015)
Article DOI: 10.1021/jm501833t
BindingDB Entry DOI: 10.7270/Q2W37Z1D
Beta-secretase 1
(Homo sapiens (Human))
BDBM50078324
(CHEMBL3414708 | US9260455, 8)
Show SMILES [H][C@]12CSC(N)=N[C@]1(CO[C@@H](COC)C2)c1ccc(F)cc1F |r,c:5|
Show InChI InChI=1S/C15H18F2N2O2S/c1-20-6-11-4-9-7-22-14(18)19-15(9,8-21-11)12-3-2-10(16)5-13(12)17/h2-3,5,9,11H,4,6-8H2,1H3,(H2,18,19)/t9-,11+,15-/m0/s1
n/an/a 30n/an/an/an/an/an/a
Eurofarma Laboratorios S.A.
Curated by ChEMBL
Assay Description
Inhibition of BACE1 in human H4 cells overexpressing APP695 assessed as sAPPbeta level after 18 hrs by ELISA
J Med Chem 58: 2678-702 (2015)
Article DOI: 10.1021/jm501833t
BindingDB Entry DOI: 10.7270/Q2W37Z1D