BDBM50080594 (2R,3R,4S)-4-Benzo[1,3]dioxol-5-yl-1-[(2-ethyl-6-methyl-phenylcarbamoyl)-methyl]-2-(4-methoxy-phenyl)-pyrrolidine-3-carboxylic acid::CHEMBL421073
SMILES: CCc1cccc(C)c1NC(=O)CN1C[C@@H]([C@H]([C@@H]1c1ccc(OC)cc1)C(O)=O)c1ccc2OCOc2c1
InChI Key: InChIKey=JPBZOZDHBRRLBM-LFOKJVLGSA-N
Data: 2 IC50
Activity Spreadsheet -- Enzyme Inhibition Constant Data from BindingDB
Found 2 hits for monomerid = 50080594
Trg + Lig
Ki
nM
ΔG°
kcal/mole
IC50
nM
Kd
nM
EC50/IC50
nM
koff
s-1
kon
M-1s-1
pHTemp
°C
EDNRB
(Homo sapiens (Human))
BDBM50080594
((2R,3R,4S)-4-Benzo[1,3]dioxol-5-yl-1-[(2-ethyl-6-m...)
Show SMILES CCc1cccc(C)c1NC(=O)CN1C[C@@H]([C@H]([C@@H]1c1ccc(OC)cc1)C(O)=O)c1ccc2OCOc2c1
Show InChI InChI=1S/C30H32N2O6/c1-4-19-7-5-6-18(2)28(19)31-26(33)16-32-15-23(21-10-13-24-25(14-21)38-17-37-24)27(30(34)35)29(32)20-8-11-22(36-3)12-9-20/h5-14,23,27,29H,4,15-17H2,1-3H3,(H,31,33)(H,34,35)/t23-,27-,29+/m1/s1
n/an/a 4n/an/an/an/an/an/a
Abbott Laboratories
Curated by ChEMBL
Assay Description
Binding affinity towards human Endothelin B receptor (hET -B)
J Med Chem 42: 3668-78 (1999)
Article DOI: 10.1021/jm990170q
BindingDB Entry DOI: 10.7270/Q24T6HK7
Endothelin-1 receptor
(Homo sapiens (Human))
BDBM50080594
((2R,3R,4S)-4-Benzo[1,3]dioxol-5-yl-1-[(2-ethyl-6-m...)
Show SMILES CCc1cccc(C)c1NC(=O)CN1C[C@@H]([C@H]([C@@H]1c1ccc(OC)cc1)C(O)=O)c1ccc2OCOc2c1
Show InChI InChI=1S/C30H32N2O6/c1-4-19-7-5-6-18(2)28(19)31-26(33)16-32-15-23(21-10-13-24-25(14-21)38-17-37-24)27(30(34)35)29(32)20-8-11-22(36-3)12-9-20/h5-14,23,27,29H,4,15-17H2,1-3H3,(H,31,33)(H,34,35)/t23-,27-,29+/m1/s1
n/an/a 15n/an/an/an/an/an/a
Abbott Laboratories
Curated by ChEMBL
Assay Description
Binding affinity towards human Endothelin A receptor (hET -A)
J Med Chem 42: 3668-78 (1999)
Article DOI: 10.1021/jm990170q
BindingDB Entry DOI: 10.7270/Q24T6HK7