BDBM50080620 (2R,3R,4S)-4-Benzo[1,3]dioxol-5-yl-2-(4-methoxy-phenyl)-1-[(3-methyl-1-phenyl-butylcarbamoyl)-methyl]-pyrrolidine-3-carboxylic acid; TFA::CHEMBL333034
SMILES: COc1ccc(cc1)[C@H]1[C@@H]([C@H](CN1CC(=O)NC(CC(C)C)c1ccccc1)c1ccc2OCOc2c1)C(O)=O
InChI Key: InChIKey=HFWWOBMAMIJJEP-BBVCMRRWSA-N
Data: 2 IC50
Activity Spreadsheet -- Enzyme Inhibition Constant Data from BindingDB
Found 2 hits for monomerid = 50080620
Trg + Lig
Ki
nM
ΔG°
kcal/mole
IC50
nM
Kd
nM
EC50/IC50
nM
koff
s-1
kon
M-1s-1
pHTemp
°C
Endothelin-1 receptor
(Homo sapiens (Human))
BDBM50080620
((2R,3R,4S)-4-Benzo[1,3]dioxol-5-yl-2-(4-methoxy-ph...)
Show SMILES COc1ccc(cc1)[C@H]1[C@@H]([C@H](CN1CC(=O)NC(CC(C)C)c1ccccc1)c1ccc2OCOc2c1)C(O)=O
Show InChI InChI=1S/C32H36N2O6/c1-20(2)15-26(21-7-5-4-6-8-21)33-29(35)18-34-17-25(23-11-14-27-28(16-23)40-19-39-27)30(32(36)37)31(34)22-9-12-24(38-3)13-10-22/h4-14,16,20,25-26,30-31H,15,17-19H2,1-3H3,(H,33,35)(H,36,37)/t25-,26?,30-,31+/m1/s1
n/an/a 13.6n/an/an/an/an/an/a
Abbott Laboratories
Curated by ChEMBL
Assay Description
Binding ability determined by the displacement of [125I]-ET-1 from the human endothelin A receptor
J Med Chem 42: 3679-89 (1999)
Article DOI: 10.1021/jm990171i
BindingDB Entry DOI: 10.7270/Q2125RVT
EDNRB
(Homo sapiens (Human))
BDBM50080620
((2R,3R,4S)-4-Benzo[1,3]dioxol-5-yl-2-(4-methoxy-ph...)
Show SMILES COc1ccc(cc1)[C@H]1[C@@H]([C@H](CN1CC(=O)NC(CC(C)C)c1ccccc1)c1ccc2OCOc2c1)C(O)=O
Show InChI InChI=1S/C32H36N2O6/c1-20(2)15-26(21-7-5-4-6-8-21)33-29(35)18-34-17-25(23-11-14-27-28(16-23)40-19-39-27)30(32(36)37)31(34)22-9-12-24(38-3)13-10-22/h4-14,16,20,25-26,30-31H,15,17-19H2,1-3H3,(H,33,35)(H,36,37)/t25-,26?,30-,31+/m1/s1
n/an/a 3.40n/an/an/an/an/an/a
Abbott Laboratories
Curated by ChEMBL
Assay Description
Binding ability determined by the displacement of [125 I]ET-3 from the human Endothelin B receptor
J Med Chem 42: 3679-89 (1999)
Article DOI: 10.1021/jm990171i
BindingDB Entry DOI: 10.7270/Q2125RVT