BDBM50084677 3-Methyl-2-(naphthalene-1-sulfonylamino)-pentanoic acid [1-formyl-2-(1H-indol-3-yl)-ethyl]-amide::CHEMBL115676
SMILES: CCC(C)[C@H](NS(=O)(=O)c1cccc2ccccc12)C(=O)N[C@@H](Cc1c[nH]c2ccccc12)C=O
InChI Key: InChIKey=FFPHAWVFZQFOJA-PSHWQTJJSA-N
Data: 1 IC50
Activity Spreadsheet -- Enzyme Inhibition Constant Data from BindingDB
Found 1 hit for monomerid = 50084677
Trg + Lig
Ki
nM
ΔG°
kcal/mole
IC50
nM
Kd
nM
EC50/IC50
nM
koff
s-1
kon
M-1s-1
pHTemp
°C
Procathepsin L
(Homo sapiens (Human))
BDBM50084677
(3-Methyl-2-(naphthalene-1-sulfonylamino)-pentanoic...)
Show SMILES CCC(C)[C@H](NS(=O)(=O)c1cccc2ccccc12)C(=O)N[C@@H](Cc1c[nH]c2ccccc12)C=O
Show InChI InChI=1S/C27H29N3O4S/c1-3-18(2)26(30-35(33,34)25-14-8-10-19-9-4-5-12-23(19)25)27(32)29-21(17-31)15-20-16-28-24-13-7-6-11-22(20)24/h4-14,16-18,21,26,28,30H,3,15H2,1-2H3,(H,29,32)/t18?,21-,26-/m0/s1
Reactome pathway
n/an/a 1.90n/an/an/an/an/an/a
University of Queensland
Curated by ChEMBL
Assay Description
Inhibitory activity against cathepsin L
J Med Chem 43: 305-41 (2000)
Checked by Author
BindingDB Entry DOI: 10.7270/Q2JD4XH4