BDBM50086229 CHEMBL326815
SMILES: Cc1c(O)c(=O)ccn1-c1ccccc1
InChI Key: InChIKey=BNXSABDYGOUQQI-UHFFFAOYSA-N
Data: 4 IC50
Activity Spreadsheet -- Enzyme Inhibition Constant Data from BindingDB
Found 5 hits for monomerid = 50086229
Trg + Lig
Ki
nM
ΔG°
kcal/mole
IC50
nM
Kd
nM
EC50/IC50
nM
koff
s-1
kon
M-1s-1
pHTemp
°C
Catechol O-methyltransferase (MB-COMT)
(Homo sapiens (Human))
BDBM50086229
(CHEMBL326815)
Show SMILES Cc1c(O)c(=O)ccn1-c1ccccc1
Show InChI InChI=1S/C12H11NO2/c1-9-12(15)11(14)7-8-13(9)10-5-3-2-4-6-10/h2-8,15H,1H3
n/an/a 1.80E+4n/an/an/an/an/an/a
Merck Research Laboratories
Curated by ChEMBL
Assay Description
Inhibition of C-terminal His6-tagged recombinant human membrane bound COMT expressed in Bacmid infected Sf-9 insect cells using dopamine/SAM as subst...
ACS Med Chem Lett 6: 318-23 (2015)
Article DOI: 10.1021/ml500502d
BindingDB Entry DOI: 10.7270/Q2K35WDZ
Acetylcholinesterase
(Electrophorus electricus (Electric eel))
BDBM50086229
(CHEMBL326815)
Show SMILES Cc1c(O)c(=O)ccn1-c1ccccc1
Show InChI InChI=1S/C12H11NO2/c1-9-12(15)11(14)7-8-13(9)10-5-3-2-4-6-10/h2-8,15H,1H3
n/an/a 2.20E+5n/an/an/an/an/an/a
University of British Columbia
Curated by ChEMBL
Assay Description
Inhibition of electric eel AChE using acetylthiocholine iodide as substrate by Ellman's method
Bioorg Med Chem Lett 26: 1624-8 (2016)
BindingDB Entry DOI: 10.7270/Q2W66NND
Acetylcholinesterase
(Electrophorus electricus (Electric eel))
BDBM50086229
(CHEMBL326815)
Show SMILES Cc1c(O)c(=O)ccn1-c1ccccc1
Show InChI InChI=1S/C12H11NO2/c1-9-12(15)11(14)7-8-13(9)10-5-3-2-4-6-10/h2-8,15H,1H3
n/an/a 2.10E+5n/an/an/an/an/an/a
TBA
Citation and Details
PA/PB1
(Hepatitis C virus)
BDBM50086229
(CHEMBL326815)
Show SMILES Cc1c(O)c(=O)ccn1-c1ccccc1
Show InChI InChI=1S/C12H11NO2/c1-9-12(15)11(14)7-8-13(9)10-5-3-2-4-6-10/h2-8,15H,1H3
n/an/a 2.00E+4n/an/an/an/an/an/a
University of California San Diego
Curated by ChEMBL
Assay Description
Inhibition of 8-histidine tagged influenza virus H1N1 N-terminal PA endonuclease expressed in Escherichia coli BL21 cells using single-stranded 5'-FA...
J Med Chem 59: 6444-54 (2016)
Article DOI: 10.1021/acs.jmedchem.6b00628
PA/PB1
(Hepatitis C virus)
BDBM50086229
(CHEMBL326815)
Show SMILES Cc1c(O)c(=O)ccn1-c1ccccc1
Show InChI InChI=1S/C12H11NO2/c1-9-12(15)11(14)7-8-13(9)10-5-3-2-4-6-10/h2-8,15H,1H3
n/an/a 1.80E+4n/an/an/an/an/an/a
University of California San Diego
Curated by ChEMBL
Assay Description
Inhibition of 8-histidine tagged influenza virus H1N1 N-terminal PA endonuclease expressed in Escherichia coli BL21 cells using single-stranded 5'-FA...
J Med Chem 59: 6444-54 (2016)
Article DOI: 10.1021/acs.jmedchem.6b00628