BDBM50088580 CHEMBL3577344
SMILES: CCCCn1cc(CCCOc2ccc(cc2OC)C(=O)NCCCCN(CCC)CCc2ccc(O)c3[nH]c(=O)ccc23)nn1
InChI Key: InChIKey=BOUDGQUEAMMTAE-UHFFFAOYSA-N
Data: 6 KI  5 EC50
Activity Spreadsheet -- Enzyme Inhibition Constant Data from BindingDB
Found 11 hits for monomerid = 50088580
Trg + Lig
Ki
nM
ΔG°
kcal/mole
IC50
nM
Kd
nM
EC50/IC50
nM
koff
s-1
kon
M-1s-1
pHTemp
°C
D(3) dopamine receptor
(Homo sapiens (Human))
BDBM50088580
(CHEMBL3577344)
Show SMILES CCCCn1cc(CCCOc2ccc(cc2OC)C(=O)NCCCCN(CCC)CCc2ccc(O)c3[nH]c(=O)ccc23)nn1
Show InChI InChI=1S/C35H48N6O5/c1-4-6-21-41-25-28(38-39-41)10-9-23-46-31-15-12-27(24-32(31)45-3)35(44)36-18-7-8-20-40(19-5-2)22-17-26-11-14-30(42)34-29(26)13-16-33(43)37-34/h11-16,24-25,42H,4-10,17-23H2,1-3H3,(H,36,44)(H,37,43)
1.60n/an/an/an/an/an/an/an/a
Friedrich Alexander University
Curated by ChEMBL
Assay Description
Displacement of [3H]spiperone from human dopamine D3 receptor transfected in CHO cells after 1 hr by scintillation counting analysis
J Med Chem 58: 2703-17 (2015)
Article DOI: 10.1021/jm501889t
BindingDB Entry DOI: 10.7270/Q2R49SHG
D(2) dopamine receptor
(Homo sapiens (Human))
BDBM50088580
(CHEMBL3577344)
Show SMILES CCCCn1cc(CCCOc2ccc(cc2OC)C(=O)NCCCCN(CCC)CCc2ccc(O)c3[nH]c(=O)ccc23)nn1
Show InChI InChI=1S/C35H48N6O5/c1-4-6-21-41-25-28(38-39-41)10-9-23-46-31-15-12-27(24-32(31)45-3)35(44)36-18-7-8-20-40(19-5-2)22-17-26-11-14-30(42)34-29(26)13-16-33(43)37-34/h11-16,24-25,42H,4-10,17-23H2,1-3H3,(H,36,44)(H,37,43)
Reactome pathway
24n/an/an/an/an/an/an/an/a
Friedrich Alexander University
Curated by ChEMBL
Assay Description
Displacement of [3H]spiperone from human dopamine D2L receptor transfected in CHO cells after 1 hr by scintillation counting analysis
J Med Chem 58: 2703-17 (2015)
Article DOI: 10.1021/jm501889t
BindingDB Entry DOI: 10.7270/Q2R49SHG
D(2) dopamine receptor
(Homo sapiens (Human))
BDBM50088580
(CHEMBL3577344)
Show SMILES CCCCn1cc(CCCOc2ccc(cc2OC)C(=O)NCCCCN(CCC)CCc2ccc(O)c3[nH]c(=O)ccc23)nn1
Show InChI InChI=1S/C35H48N6O5/c1-4-6-21-41-25-28(38-39-41)10-9-23-46-31-15-12-27(24-32(31)45-3)35(44)36-18-7-8-20-40(19-5-2)22-17-26-11-14-30(42)34-29(26)13-16-33(43)37-34/h11-16,24-25,42H,4-10,17-23H2,1-3H3,(H,36,44)(H,37,43)
Reactome pathway
53n/an/an/an/an/an/an/an/a
Friedrich Alexander University
Curated by ChEMBL
Assay Description
Displacement of [3H]spiperone from human dopamine D2S receptor transfected in CHO cells after 1 hr by scintillation counting analysis
J Med Chem 58: 2703-17 (2015)
Article DOI: 10.1021/jm501889t
BindingDB Entry DOI: 10.7270/Q2R49SHG
5-hydroxytryptamine receptor 2A
(Homo sapiens (Human))
BDBM50088580
(CHEMBL3577344)
Show SMILES CCCCn1cc(CCCOc2ccc(cc2OC)C(=O)NCCCCN(CCC)CCc2ccc(O)c3[nH]c(=O)ccc23)nn1
Show InChI InChI=1S/C35H48N6O5/c1-4-6-21-41-25-28(38-39-41)10-9-23-46-31-15-12-27(24-32(31)45-3)35(44)36-18-7-8-20-40(19-5-2)22-17-26-11-14-30(42)34-29(26)13-16-33(43)37-34/h11-16,24-25,42H,4-10,17-23H2,1-3H3,(H,36,44)(H,37,43)
Reactome pathway
3.60E+3n/an/an/an/an/an/an/an/a
Friedrich Alexander University
Curated by ChEMBL
Assay Description
Displacement of [3H]ketanserin from human 5-HT2A receptor transfected in HEK293 cells by scintillation counting analysis
J Med Chem 58: 2703-17 (2015)
Article DOI: 10.1021/jm501889t
BindingDB Entry DOI: 10.7270/Q2R49SHG
D(1A) dopamine receptor
(Homo sapiens (Human))
BDBM50088580
(CHEMBL3577344)
Show SMILES CCCCn1cc(CCCOc2ccc(cc2OC)C(=O)NCCCCN(CCC)CCc2ccc(O)c3[nH]c(=O)ccc23)nn1
Show InChI InChI=1S/C35H48N6O5/c1-4-6-21-41-25-28(38-39-41)10-9-23-46-31-15-12-27(24-32(31)45-3)35(44)36-18-7-8-20-40(19-5-2)22-17-26-11-14-30(42)34-29(26)13-16-33(43)37-34/h11-16,24-25,42H,4-10,17-23H2,1-3H3,(H,36,44)(H,37,43)
4.60E+3n/an/an/an/an/an/an/an/a
Friedrich Alexander University
Curated by ChEMBL
Assay Description
Displacement of [3H]SCH23390 from human dopamine D1 receptor transfected in HEK293 cells after 1 hr by scintillation counting analysis
J Med Chem 58: 2703-17 (2015)
Article DOI: 10.1021/jm501889t
BindingDB Entry DOI: 10.7270/Q2R49SHG
D(1B) dopamine receptor
(Homo sapiens (Human))
BDBM50088580
(CHEMBL3577344)
Show SMILES CCCCn1cc(CCCOc2ccc(cc2OC)C(=O)NCCCCN(CCC)CCc2ccc(O)c3[nH]c(=O)ccc23)nn1
Show InChI InChI=1S/C35H48N6O5/c1-4-6-21-41-25-28(38-39-41)10-9-23-46-31-15-12-27(24-32(31)45-3)35(44)36-18-7-8-20-40(19-5-2)22-17-26-11-14-30(42)34-29(26)13-16-33(43)37-34/h11-16,24-25,42H,4-10,17-23H2,1-3H3,(H,36,44)(H,37,43)
2.50E+4n/an/an/an/an/an/an/an/a
Friedrich Alexander University
Curated by ChEMBL
Assay Description
Displacement of [3H]SCH23390 from human dopamine D5 receptor transfected in HEK293 cells after 1 hr by scintillation counting analysis
J Med Chem 58: 2703-17 (2015)
Article DOI: 10.1021/jm501889t
BindingDB Entry DOI: 10.7270/Q2R49SHG
D(2) dopamine receptor
(Homo sapiens (Human))
BDBM50088580
(CHEMBL3577344)
Show SMILES CCCCn1cc(CCCOc2ccc(cc2OC)C(=O)NCCCCN(CCC)CCc2ccc(O)c3[nH]c(=O)ccc23)nn1
Show InChI InChI=1S/C35H48N6O5/c1-4-6-21-41-25-28(38-39-41)10-9-23-46-31-15-12-27(24-32(31)45-3)35(44)36-18-7-8-20-40(19-5-2)22-17-26-11-14-30(42)34-29(26)13-16-33(43)37-34/h11-16,24-25,42H,4-10,17-23H2,1-3H3,(H,36,44)(H,37,43)
Reactome pathway
n/an/an/an/a 140n/an/an/an/a
Friedrich Alexander University
Curated by ChEMBL
Assay Description
Agonist activity at ARMS2-PK2-tagged human dopamine D2S receptor expressed in HEK293 cells co-expressing (EA)-tagged beta arrestin fusion protein ass...
J Med Chem 58: 2703-17 (2015)
Article DOI: 10.1021/jm501889t
BindingDB Entry DOI: 10.7270/Q2R49SHG
D(2) dopamine receptor
(Homo sapiens (Human))
BDBM50088580
(CHEMBL3577344)
Show SMILES CCCCn1cc(CCCOc2ccc(cc2OC)C(=O)NCCCCN(CCC)CCc2ccc(O)c3[nH]c(=O)ccc23)nn1
Show InChI InChI=1S/C35H48N6O5/c1-4-6-21-41-25-28(38-39-41)10-9-23-46-31-15-12-27(24-32(31)45-3)35(44)36-18-7-8-20-40(19-5-2)22-17-26-11-14-30(42)34-29(26)13-16-33(43)37-34/h11-16,24-25,42H,4-10,17-23H2,1-3H3,(H,36,44)(H,37,43)
Reactome pathway
n/an/an/an/a 980n/an/an/an/a
Friedrich Alexander University
Curated by ChEMBL
Assay Description
Intrinsic activity at human dopamine D2S receptor expressed in HEK293 cells co-transfected with Galpha0i assessed as [35S]GTPgammaS binding after 30 ...
J Med Chem 58: 2703-17 (2015)
Article DOI: 10.1021/jm501889t
BindingDB Entry DOI: 10.7270/Q2R49SHG
D(2) dopamine receptor
(Homo sapiens (Human))
BDBM50088580
(CHEMBL3577344)
Show SMILES CCCCn1cc(CCCOc2ccc(cc2OC)C(=O)NCCCCN(CCC)CCc2ccc(O)c3[nH]c(=O)ccc23)nn1
Show InChI InChI=1S/C35H48N6O5/c1-4-6-21-41-25-28(38-39-41)10-9-23-46-31-15-12-27(24-32(31)45-3)35(44)36-18-7-8-20-40(19-5-2)22-17-26-11-14-30(42)34-29(26)13-16-33(43)37-34/h11-16,24-25,42H,4-10,17-23H2,1-3H3,(H,36,44)(H,37,43)
Reactome pathway
n/an/an/an/a 1.70E+3n/an/an/an/a
Friedrich Alexander University
Curated by ChEMBL
Assay Description
Intrinsic activity at human dopamine D2S receptor expressed in HEK293 cells co-transfected with Galphai2 assessed as [35S]GTPgammaS binding after 30 ...
J Med Chem 58: 2703-17 (2015)
Article DOI: 10.1021/jm501889t
BindingDB Entry DOI: 10.7270/Q2R49SHG
D(2) dopamine receptor
(Homo sapiens (Human))
BDBM50088580
(CHEMBL3577344)
Show SMILES CCCCn1cc(CCCOc2ccc(cc2OC)C(=O)NCCCCN(CCC)CCc2ccc(O)c3[nH]c(=O)ccc23)nn1
Show InChI InChI=1S/C35H48N6O5/c1-4-6-21-41-25-28(38-39-41)10-9-23-46-31-15-12-27(24-32(31)45-3)35(44)36-18-7-8-20-40(19-5-2)22-17-26-11-14-30(42)34-29(26)13-16-33(43)37-34/h11-16,24-25,42H,4-10,17-23H2,1-3H3,(H,36,44)(H,37,43)
Reactome pathway
n/an/an/an/a 3.80E+3n/an/an/an/a
Friedrich Alexander University
Curated by ChEMBL
Assay Description
Intrinsic activity at human dopamine D2L receptor expressed in HEK293 cells co-transfected with Galpha0i assessed as [35S]GTPgammaS binding after 30 ...
J Med Chem 58: 2703-17 (2015)
Article DOI: 10.1021/jm501889t
BindingDB Entry DOI: 10.7270/Q2R49SHG
D(2) dopamine receptor
(Homo sapiens (Human))
BDBM50088580
(CHEMBL3577344)
Show SMILES CCCCn1cc(CCCOc2ccc(cc2OC)C(=O)NCCCCN(CCC)CCc2ccc(O)c3[nH]c(=O)ccc23)nn1
Show InChI InChI=1S/C35H48N6O5/c1-4-6-21-41-25-28(38-39-41)10-9-23-46-31-15-12-27(24-32(31)45-3)35(44)36-18-7-8-20-40(19-5-2)22-17-26-11-14-30(42)34-29(26)13-16-33(43)37-34/h11-16,24-25,42H,4-10,17-23H2,1-3H3,(H,36,44)(H,37,43)
Reactome pathway
n/an/an/an/a 7.30E+3n/an/an/an/a
Friedrich Alexander University
Curated by ChEMBL
Assay Description
Intrinsic activity at human dopamine D2L receptor expressed in HEK293 cells co-transfected with Galphai2 assessed as [35S]GTPgammaS binding after 30 ...
J Med Chem 58: 2703-17 (2015)
Article DOI: 10.1021/jm501889t
BindingDB Entry DOI: 10.7270/Q2R49SHG