BDBM50097654 (4S,5R,6R)-4-Amino-6-dipropylcarbamoyl-5-propionylamino-5,6-dihydro-4H-pyran-2-carboxylic acid::CHEMBL346767
SMILES: CCCN(CCC)C(=O)[C@@H]1OC(=C[C@H](N)[C@H]1NC(=O)CC)C(O)=O
InChI Key: InChIKey=SVNMOASEXDAETI-ZLKJLUDKSA-N
Data: 2 IC50
Activity Spreadsheet -- Enzyme Inhibition Constant Data from BindingDB
Found 2 hits for monomerid = 50097654
Trg + Lig
Ki
nM
ΔG°
kcal/mole
IC50
nM
Kd
nM
EC50/IC50
nM
koff
s-1
kon
M-1s-1
pHTemp
°C
Neuraminidase B
(Influenza B virus (B/Lee/40))
BDBM50097654
((4S,5R,6R)-4-Amino-6-dipropylcarbamoyl-5-propionyl...)
Show SMILES CCCN(CCC)C(=O)[C@@H]1OC(=C[C@H](N)[C@H]1NC(=O)CC)C(O)=O |c:11|
Show InChI InChI=1S/C16H27N3O5/c1-4-7-19(8-5-2)15(21)14-13(18-12(20)6-3)10(17)9-11(24-14)16(22)23/h9-10,13-14H,4-8,17H2,1-3H3,(H,18,20)(H,22,23)/t10-,13+,14+/m0/s1
n/an/a 7.00E+3n/an/an/an/an/an/a
Glaxo Wellcome Medicines Research Centre
Curated by ChEMBL
Assay Description
Inhibitory activity against influenza B sialidase (Victoria)
Bioorg Med Chem Lett 11: 669-73 (2001)
BindingDB Entry DOI: 10.7270/Q26M37CN
Neuraminidase A
(Influenza A virus (A/Puerto Rico/8/34/Mount Sinai(...)
BDBM50097654
((4S,5R,6R)-4-Amino-6-dipropylcarbamoyl-5-propionyl...)
Show SMILES CCCN(CCC)C(=O)[C@@H]1OC(=C[C@H](N)[C@H]1NC(=O)CC)C(O)=O |c:11|
Show InChI InChI=1S/C16H27N3O5/c1-4-7-19(8-5-2)15(21)14-13(18-12(20)6-3)10(17)9-11(24-14)16(22)23/h9-10,13-14H,4-8,17H2,1-3H3,(H,18,20)(H,22,23)/t10-,13+,14+/m0/s1
n/an/a 5n/an/an/an/an/an/a
Glaxo Wellcome Medicines Research Centre
Curated by ChEMBL
Assay Description
Inhibitory activity against influenza A sialidase (Aichi)
Bioorg Med Chem Lett 11: 669-73 (2001)
BindingDB Entry DOI: 10.7270/Q26M37CN