BDBM50104295 2-[(2-Hydroxy-1-methyl-2,2-diphenyl-ethylamino)-methyl]-pyrrolidine-3,4-diol::CHEMBL421340
SMILES: CC(NCC1NCC(O)C1O)C(O)(c1ccccc1)c1ccccc1
InChI Key: InChIKey=YKDIBSLOOWMSJH-UHFFFAOYSA-N
Data: 2 KI  4 IC50
Activity Spreadsheet -- Enzyme Inhibition Constant Data from BindingDB
Found 6 hits for monomerid = 50104295
Trg + Lig
Ki
nM
ΔG°
kcal/mole
IC50
nM
Kd
nM
EC50/IC50
nM
koff
s-1
kon
M-1s-1
pHTemp
°C
β-galactosidase
(Bos taurus (Bovine))
BDBM50104295
(2-[(2-Hydroxy-1-methyl-2,2-diphenyl-ethylamino)-me...)
Show SMILES CC(NCC1NCC(O)C1O)C(O)(c1ccccc1)c1ccccc1
Show InChI InChI=1S/C20H26N2O3/c1-14(21-12-17-19(24)18(23)13-22-17)20(25,15-8-4-2-5-9-15)16-10-6-3-7-11-16/h2-11,14,17-19,21-25H,12-13H2,1H3
2.10E+4n/an/an/an/an/an/an/an/a
Section de Chimie de l'Universit£ de Lausanne
Curated by ChEMBL
Assay Description
Inhibitory activity towards Beta-galactosidase from Bovine liver
Bioorg Med Chem Lett 11: 2489-93 (2001)
BindingDB Entry DOI: 10.7270/Q2H70GBZ
Alpha-mannosidase
(Glycine max)
BDBM50104295
(2-[(2-Hydroxy-1-methyl-2,2-diphenyl-ethylamino)-me...)
Show SMILES CC(NCC1NCC(O)C1O)C(O)(c1ccccc1)c1ccccc1
Show InChI InChI=1S/C20H26N2O3/c1-14(21-12-17-19(24)18(23)13-22-17)20(25,15-8-4-2-5-9-15)16-10-6-3-7-11-16/h2-11,14,17-19,21-25H,12-13H2,1H3
1.70E+5n/an/an/an/an/an/an/an/a
Section de Chimie de l'Universit£ de Lausanne
Curated by ChEMBL
Assay Description
Inhibitory activity towards Alpha-mannosidase from Jack bean
Bioorg Med Chem Lett 11: 2489-93 (2001)
BindingDB Entry DOI: 10.7270/Q2H70GBZ
Beta-galactosidase/Glucosylceramidase
(Bos taurus (Bovine))
BDBM50104295
(2-[(2-Hydroxy-1-methyl-2,2-diphenyl-ethylamino)-me...)
Show SMILES CC(NCC1NCC(O)C1O)C(O)(c1ccccc1)c1ccccc1
Show InChI InChI=1S/C20H26N2O3/c1-14(21-12-17-19(24)18(23)13-22-17)20(25,15-8-4-2-5-9-15)16-10-6-3-7-11-16/h2-11,14,17-19,21-25H,12-13H2,1H3
n/an/a 1.40E+5n/an/an/an/an/an/a
Section de Chimie de l'Universit£ de Lausanne
Curated by ChEMBL
Assay Description
Inhibitory activity towards Alpha-mannosidase from Jack bean
Bioorg Med Chem Lett 11: 2489-93 (2001)
BindingDB Entry DOI: 10.7270/Q2H70GBZ
Beta-glucosidase
(Prunus avium)
BDBM50104295
(2-[(2-Hydroxy-1-methyl-2,2-diphenyl-ethylamino)-me...)
Show SMILES CC(NCC1NCC(O)C1O)C(O)(c1ccccc1)c1ccccc1
Show InChI InChI=1S/C20H26N2O3/c1-14(21-12-17-19(24)18(23)13-22-17)20(25,15-8-4-2-5-9-15)16-10-6-3-7-11-16/h2-11,14,17-19,21-25H,12-13H2,1H3
n/an/a 5.50E+5n/an/an/an/an/an/a
Section de Chimie de l'Universit£ de Lausanne
Curated by ChEMBL
Assay Description
Inhibitory activity towards Beta-Glucosidase from Almond
Bioorg Med Chem Lett 11: 2489-93 (2001)
BindingDB Entry DOI: 10.7270/Q2H70GBZ
Alpha-mannosidase
(Glycine max)
BDBM50104295
(2-[(2-Hydroxy-1-methyl-2,2-diphenyl-ethylamino)-me...)
Show SMILES CC(NCC1NCC(O)C1O)C(O)(c1ccccc1)c1ccccc1
Show InChI InChI=1S/C20H26N2O3/c1-14(21-12-17-19(24)18(23)13-22-17)20(25,15-8-4-2-5-9-15)16-10-6-3-7-11-16/h2-11,14,17-19,21-25H,12-13H2,1H3
n/an/a 4.40E+5n/an/an/an/an/an/a
Section de Chimie de l'Universit£ de Lausanne
Curated by ChEMBL
Assay Description
Inhibitory activity towards Alpha-mannosidase from Jack bean
Bioorg Med Chem Lett 11: 2489-93 (2001)
BindingDB Entry DOI: 10.7270/Q2H70GBZ
Beta-glucosidase A
(Caldocellum saccharolyticum)
BDBM50104295
(2-[(2-Hydroxy-1-methyl-2,2-diphenyl-ethylamino)-me...)
Show SMILES CC(NCC1NCC(O)C1O)C(O)(c1ccccc1)c1ccccc1
Show InChI InChI=1S/C20H26N2O3/c1-14(21-12-17-19(24)18(23)13-22-17)20(25,15-8-4-2-5-9-15)16-10-6-3-7-11-16/h2-11,14,17-19,21-25H,12-13H2,1H3
n/an/a 3.20E+5n/an/an/an/an/an/a
Section de Chimie de l'Universit£ de Lausanne
Curated by ChEMBL
Assay Description
Inhibitory activity towards Beta-Glucosidase from Caldocellum saccharol.
Bioorg Med Chem Lett 11: 2489-93 (2001)
BindingDB Entry DOI: 10.7270/Q2H70GBZ