BDBM50106501 6,7-Dichloro-5,8-quinolinequinone::6,7-Dichloro-quinoline-5,8-dione::CHEMBL132160
SMILES: ClC1=C(Cl)C(=O)c2ncccc2C1=O
InChI Key: InChIKey=TUWOPVCIIBKUQS-UHFFFAOYSA-N
Data: 4 IC50
Activity Spreadsheet -- Enzyme Inhibition Constant Data from BindingDB
Found 4 hits for monomerid = 50106501
Trg + Lig
Ki
nM
ΔG°
kcal/mole
IC50
nM
Kd
nM
EC50/IC50
nM
koff
s-1
kon
M-1s-1
pHTemp
°C
Tyrosine-protein phosphatase non-receptor type 1
(Homo sapiens (Human))
BDBM50106501
(6,7-Dichloro-5,8-quinolinequinone | 6,7-Dichloro-q...)
Show SMILES ClC1=C(Cl)C(=O)c2ncccc2C1=O |c:1|
Show InChI InChI=1S/C9H3Cl2NO2/c10-5-6(11)9(14)7-4(8(5)13)2-1-3-12-7/h1-3H
NCI pathway
Reactome pathway
n/an/a>1.00E+4n/an/an/an/an/an/a
University of Pittsburgh
Curated by ChEMBL
Assay Description
Inhibitory Activity against Recombinant Human PTP1
J Med Chem 44: 4042-9 (2001)
BindingDB Entry DOI: 10.7270/Q2X34WR5
Genome polyprotein
(Coxsackievirus B3 (strain Nancy))
BDBM50106501
(6,7-Dichloro-5,8-quinolinequinone | 6,7-Dichloro-q...)
Show SMILES ClC1=C(Cl)C(=O)c2ncccc2C1=O |c:1|
Show InChI InChI=1S/C9H3Cl2NO2/c10-5-6(11)9(14)7-4(8(5)13)2-1-3-12-7/h1-3H
n/an/a 630n/an/an/an/an/an/a
Korea Research Institute of Chemical Technology
Curated by ChEMBL
Assay Description
Inhibition of human coxsackievirus B3 protease 3C expressed in Escherichia coli (BL21) using fluorogenic-Dabcyl-KEALFQGPPQFE-Edans as substrate after...
Bioorg Med Chem Lett 28: 2533-2538 (2018)
Article DOI: 10.1016/j.bmcl.2018.05.046
BindingDB Entry DOI: 10.7270/Q2HT2S0T
Dual specificity protein phosphatase 3
(Homo sapiens (Human))
BDBM50106501
(6,7-Dichloro-5,8-quinolinequinone | 6,7-Dichloro-q...)
Show SMILES ClC1=C(Cl)C(=O)c2ncccc2C1=O |c:1|
Show InChI InChI=1S/C9H3Cl2NO2/c10-5-6(11)9(14)7-4(8(5)13)2-1-3-12-7/h1-3H
Reactome pathway
n/an/a>1.00E+4n/an/an/an/an/an/a
University of Pittsburgh
Curated by ChEMBL
Assay Description
Inhibitory Activity against Recombinant Human VHR
J Med Chem 44: 4042-9 (2001)
BindingDB Entry DOI: 10.7270/Q2X34WR5
M-phase inducer phosphatase 2
(Homo sapiens (Human))
BDBM50106501
(6,7-Dichloro-5,8-quinolinequinone | 6,7-Dichloro-q...)
Show SMILES ClC1=C(Cl)C(=O)c2ncccc2C1=O |c:1|
Show InChI InChI=1S/C9H3Cl2NO2/c10-5-6(11)9(14)7-4(8(5)13)2-1-3-12-7/h1-3H
Reactome pathway
n/an/a 4.60E+3n/an/an/an/an/an/a
University of Pittsburgh
Curated by ChEMBL
Assay Description
Inhibitory activity against recombinant human cell division cycle 25B
J Med Chem 44: 4042-9 (2001)
BindingDB Entry DOI: 10.7270/Q2X34WR5