BDBM50119632 CHEMBL3618445
SMILES: C\C(NCc1ccccc1F)=N/c1ccc2C[C@@H](O)[C@H](NC(=O)c3ccc(Br)cc3)c2c1
InChI Key: InChIKey=PQFYMKJLSHXJPL-DNQXCXABSA-N
Data: 3 EC50
Activity Spreadsheet -- Enzyme Inhibition Constant Data from BindingDB
Found 3 hits for monomerid = 50119632
Trg + Lig
Ki
nM
ΔG°
kcal/mole
IC50
nM
Kd
nM
EC50/IC50
nM
koff
s-1
kon
M-1s-1
pHTemp
°C
Muscarinic acetylcholine receptor M1
(Homo sapiens (Human))
BDBM50119632
(CHEMBL3618445)
Show SMILES C\C(NCc1ccccc1F)=N/c1ccc2C[C@@H](O)[C@H](NC(=O)c3ccc(Br)cc3)c2c1 |r|
Show InChI InChI=1S/C25H23BrFN3O2/c1-15(28-14-18-4-2-3-5-22(18)27)29-20-11-8-17-12-23(31)24(21(17)13-20)30-25(32)16-6-9-19(26)10-7-16/h2-11,13,23-24,31H,12,14H2,1H3,(H,28,29)(H,30,32)/t23-,24-/m1/s1
n/an/an/an/a 87n/an/an/an/a
Lilly Research Laboratories
Curated by ChEMBL
Assay Description
Agonist activity at human muscarinic M1 receptor expressed in CHO cells after 30 mins by GTPgamma35S binding assay
Bioorg Med Chem Lett 25: 4158-63 (2015)
BindingDB Entry DOI: 10.7270/Q2GM8938
Muscarinic acetylcholine receptor M4
(Homo sapiens (Human))
BDBM50119632
(CHEMBL3618445)
Show SMILES C\C(NCc1ccccc1F)=N/c1ccc2C[C@@H](O)[C@H](NC(=O)c3ccc(Br)cc3)c2c1 |r|
Show InChI InChI=1S/C25H23BrFN3O2/c1-15(28-14-18-4-2-3-5-22(18)27)29-20-11-8-17-12-23(31)24(21(17)13-20)30-25(32)16-6-9-19(26)10-7-16/h2-11,13,23-24,31H,12,14H2,1H3,(H,28,29)(H,30,32)/t23-,24-/m1/s1
Reactome pathway
n/an/an/an/a 227n/an/an/an/a
Lilly Research Laboratories
Curated by ChEMBL
Assay Description
Agonist activity at human muscarinic M4 receptor expressed in CHO cells after 30 mins by GTPgamma35S binding assay
Bioorg Med Chem Lett 25: 4158-63 (2015)
BindingDB Entry DOI: 10.7270/Q2GM8938
Muscarinic acetylcholine receptor M2
(Homo sapiens (Human))
BDBM50119632
(CHEMBL3618445)
Show SMILES C\C(NCc1ccccc1F)=N/c1ccc2C[C@@H](O)[C@H](NC(=O)c3ccc(Br)cc3)c2c1 |r|
Show InChI InChI=1S/C25H23BrFN3O2/c1-15(28-14-18-4-2-3-5-22(18)27)29-20-11-8-17-12-23(31)24(21(17)13-20)30-25(32)16-6-9-19(26)10-7-16/h2-11,13,23-24,31H,12,14H2,1H3,(H,28,29)(H,30,32)/t23-,24-/m1/s1
n/an/an/an/a 118n/an/an/an/a
Lilly Research Laboratories
Curated by ChEMBL
Assay Description
Agonist activity at human muscarinic M2 receptor expressed in CHO cells after 30 mins by GTPgamma35S binding assay
Bioorg Med Chem Lett 25: 4158-63 (2015)
BindingDB Entry DOI: 10.7270/Q2GM8938