BDBM50122347 (S)-3-{4-[3,3-Bis-(4-bromo-phenyl)-allyloxy]-phenyl}-2-ethoxy-propionic acid::CHEMBL87307
SMILES: [#6]-[#6]-[#8]-[#6@@H](-[#6]-c1ccc(-[#8]-[#6]\[#6]=[#6](\c2ccc(Br)cc2)-c2ccc(Br)cc2)cc1)-[#6](-[#8])=O
InChI Key: InChIKey=OELGWRAGKMPJIK-VWLOTQADSA-N
Data: 15 EC50
Activity Spreadsheet -- Enzyme Inhibition Constant Data from BindingDB
Found 15 hits for monomerid = 50122347
Trg + Lig
Ki
nM
ΔG°
kcal/mole
IC50
nM
Kd
nM
EC50/IC50
nM
koff
s-1
kon
M-1s-1
pHTemp
°C
Peroxisome proliferator-activated receptor alpha
(Homo sapiens (Human))
BDBM50122347
((S)-3-{4-[3,3-Bis-(4-bromo-phenyl)-allyloxy]-pheny...)
Show SMILES [#6]-[#6]-[#8]-[#6@@H](-[#6]-c1ccc(-[#8]-[#6]\[#6]=[#6](\c2ccc(Br)cc2)-c2ccc(Br)cc2)cc1)-[#6](-[#8])=O
Show InChI InChI=1S/C26H24Br2O4/c1-2-31-25(26(29)30)17-18-3-13-23(14-4-18)32-16-15-24(19-5-9-21(27)10-6-19)20-7-11-22(28)12-8-20/h3-15,25H,2,16-17H2,1H3,(H,29,30)/t25-/m0/s1
n/an/an/an/a 300n/an/an/an/a
TBA
Assay Description
Transactivation of GAL4-fused Homo sapiens (human) PPARalpha DNA binding domain expressed in African green monkey CV1 cells by luciferase reporter ge...
Citation and Details
Article DOI: 10.1007/s00044-012-0003-4
BindingDB Entry DOI: 10.7270/Q280544F
Peroxisome proliferator-activated receptor gamma
(Homo sapiens (Human))
BDBM50122347
((S)-3-{4-[3,3-Bis-(4-bromo-phenyl)-allyloxy]-pheny...)
Show SMILES [#6]-[#6]-[#8]-[#6@@H](-[#6]-c1ccc(-[#8]-[#6]\[#6]=[#6](\c2ccc(Br)cc2)-c2ccc(Br)cc2)cc1)-[#6](-[#8])=O
Show InChI InChI=1S/C26H24Br2O4/c1-2-31-25(26(29)30)17-18-3-13-23(14-4-18)32-16-15-24(19-5-9-21(27)10-6-19)20-7-11-22(28)12-8-20/h3-15,25H,2,16-17H2,1H3,(H,29,30)/t25-/m0/s1
NCI pathway
Reactome pathway
n/an/an/an/a 891n/an/an/an/a
TBA
Assay Description
Transactivation of Homo sapiens (human) PPARgamma assessed as luciferase activity by reporter gene assay
Citation and Details
Article DOI: 10.1007/s00044-011-9818-7
BindingDB Entry DOI: 10.7270/Q2R49TNP
Peroxisome proliferator-activated receptor alpha
(Homo sapiens (Human))
BDBM50122347
((S)-3-{4-[3,3-Bis-(4-bromo-phenyl)-allyloxy]-pheny...)
Show SMILES [#6]-[#6]-[#8]-[#6@@H](-[#6]-c1ccc(-[#8]-[#6]\[#6]=[#6](\c2ccc(Br)cc2)-c2ccc(Br)cc2)cc1)-[#6](-[#8])=O
Show InChI InChI=1S/C26H24Br2O4/c1-2-31-25(26(29)30)17-18-3-13-23(14-4-18)32-16-15-24(19-5-9-21(27)10-6-19)20-7-11-22(28)12-8-20/h3-15,25H,2,16-17H2,1H3,(H,29,30)/t25-/m0/s1
n/an/an/an/a 300n/an/an/an/a
TBA
Assay Description
Transactivation of GAL4-fused Homo sapiens (human) PPARalpha DNA binding domain expressed in African green monkey CV1 cells by luciferase reporter ge...
Citation and Details
Article DOI: 10.1007/s00044-012-0003-4
BindingDB Entry DOI: 10.7270/Q280544F
Peroxisome proliferator-activated receptor gamma
(Homo sapiens (Human))
BDBM50122347
((S)-3-{4-[3,3-Bis-(4-bromo-phenyl)-allyloxy]-pheny...)
Show SMILES [#6]-[#6]-[#8]-[#6@@H](-[#6]-c1ccc(-[#8]-[#6]\[#6]=[#6](\c2ccc(Br)cc2)-c2ccc(Br)cc2)cc1)-[#6](-[#8])=O
Show InChI InChI=1S/C26H24Br2O4/c1-2-31-25(26(29)30)17-18-3-13-23(14-4-18)32-16-15-24(19-5-9-21(27)10-6-19)20-7-11-22(28)12-8-20/h3-15,25H,2,16-17H2,1H3,(H,29,30)/t25-/m0/s1
NCI pathway
Reactome pathway
n/an/an/an/a 900n/an/an/an/a
TBA
Assay Description
Transactivation of GAL4-fused Homo sapiens (human) PPARgamma DNA binding domain expressed in African green monkey CV1 cells by luciferase reporter ge...
Citation and Details
Article DOI: 10.1007/s00044-012-0003-4
BindingDB Entry DOI: 10.7270/Q280544F
Peroxisome proliferator-activated receptor gamma
(Homo sapiens (Human))
BDBM50122347
((S)-3-{4-[3,3-Bis-(4-bromo-phenyl)-allyloxy]-pheny...)
Show SMILES [#6]-[#6]-[#8]-[#6@@H](-[#6]-c1ccc(-[#8]-[#6]\[#6]=[#6](\c2ccc(Br)cc2)-c2ccc(Br)cc2)cc1)-[#6](-[#8])=O
Show InChI InChI=1S/C26H24Br2O4/c1-2-31-25(26(29)30)17-18-3-13-23(14-4-18)32-16-15-24(19-5-9-21(27)10-6-19)20-7-11-22(28)12-8-20/h3-15,25H,2,16-17H2,1H3,(H,29,30)/t25-/m0/s1
NCI pathway
Reactome pathway
n/an/an/an/a 900n/an/an/an/a
Novo Nordisk A/S
Curated by ChEMBL
Assay Description
In vitro activation of human peroxisome proliferator activated receptor gamma (PPAR gamma)
Bioorg Med Chem Lett 13: 257-60 (2002)
BindingDB Entry DOI: 10.7270/Q2FF3RQS
Peroxisome proliferator-activated receptor alpha
(Homo sapiens (Human))
BDBM50122347
((S)-3-{4-[3,3-Bis-(4-bromo-phenyl)-allyloxy]-pheny...)
Show SMILES [#6]-[#6]-[#8]-[#6@@H](-[#6]-c1ccc(-[#8]-[#6]\[#6]=[#6](\c2ccc(Br)cc2)-c2ccc(Br)cc2)cc1)-[#6](-[#8])=O
Show InChI InChI=1S/C26H24Br2O4/c1-2-31-25(26(29)30)17-18-3-13-23(14-4-18)32-16-15-24(19-5-9-21(27)10-6-19)20-7-11-22(28)12-8-20/h3-15,25H,2,16-17H2,1H3,(H,29,30)/t25-/m0/s1
n/an/an/an/a 300n/an/an/an/a
Novo Nordisk A/S
Curated by ChEMBL
Assay Description
In vitro activation of human peroxisome proliferator activated receptor alpha
Bioorg Med Chem Lett 13: 257-60 (2002)
BindingDB Entry DOI: 10.7270/Q2FF3RQS
Peroxisome proliferator-activated receptor delta
(Homo sapiens (Human))
BDBM50122347
((S)-3-{4-[3,3-Bis-(4-bromo-phenyl)-allyloxy]-pheny...)
Show SMILES [#6]-[#6]-[#8]-[#6@@H](-[#6]-c1ccc(-[#8]-[#6]\[#6]=[#6](\c2ccc(Br)cc2)-c2ccc(Br)cc2)cc1)-[#6](-[#8])=O
Show InChI InChI=1S/C26H24Br2O4/c1-2-31-25(26(29)30)17-18-3-13-23(14-4-18)32-16-15-24(19-5-9-21(27)10-6-19)20-7-11-22(28)12-8-20/h3-15,25H,2,16-17H2,1H3,(H,29,30)/t25-/m0/s1
n/an/an/an/a 400n/an/an/an/a
Novo Nordisk A/S
Curated by ChEMBL
Assay Description
In vitro activation of human peroxisome proliferator activated receptor delta (PPAR delta)
Bioorg Med Chem Lett 13: 257-60 (2002)
BindingDB Entry DOI: 10.7270/Q2FF3RQS
Peroxisome proliferator-activated receptor alpha
(Homo sapiens (Human))
BDBM50122347
((S)-3-{4-[3,3-Bis-(4-bromo-phenyl)-allyloxy]-pheny...)
Show SMILES [#6]-[#6]-[#8]-[#6@@H](-[#6]-c1ccc(-[#8]-[#6]\[#6]=[#6](\c2ccc(Br)cc2)-c2ccc(Br)cc2)cc1)-[#6](-[#8])=O
Show InChI InChI=1S/C26H24Br2O4/c1-2-31-25(26(29)30)17-18-3-13-23(14-4-18)32-16-15-24(19-5-9-21(27)10-6-19)20-7-11-22(28)12-8-20/h3-15,25H,2,16-17H2,1H3,(H,29,30)/t25-/m0/s1
n/an/an/an/a 390n/an/an/an/a
Novo Nordisk A/S
Curated by ChEMBL
Assay Description
Activity at human liver PPAR alpha expressed in HEK293 cells by PPAR-GAL4 transactivation assay
J Med Chem 50: 1495-503 (2007)
Article DOI: 10.1021/jm061202u
BindingDB Entry DOI: 10.7270/Q2J9662B
Peroxisome proliferator-activated receptor delta
(Homo sapiens (Human))
BDBM50122347
((S)-3-{4-[3,3-Bis-(4-bromo-phenyl)-allyloxy]-pheny...)
Show SMILES [#6]-[#6]-[#8]-[#6@@H](-[#6]-c1ccc(-[#8]-[#6]\[#6]=[#6](\c2ccc(Br)cc2)-c2ccc(Br)cc2)cc1)-[#6](-[#8])=O
Show InChI InChI=1S/C26H24Br2O4/c1-2-31-25(26(29)30)17-18-3-13-23(14-4-18)32-16-15-24(19-5-9-21(27)10-6-19)20-7-11-22(28)12-8-20/h3-15,25H,2,16-17H2,1H3,(H,29,30)/t25-/m0/s1
n/an/an/an/a 540n/an/an/an/a
Novo Nordisk A/S
Curated by ChEMBL
Assay Description
Activity at human placenta PPAR delta expressed in HEK293 cells by PPAR-GAL4 transactivation assay
J Med Chem 50: 1495-503 (2007)
Article DOI: 10.1021/jm061202u
BindingDB Entry DOI: 10.7270/Q2J9662B
Peroxisome proliferator-activated receptor gamma
(Homo sapiens (Human))
BDBM50122347
((S)-3-{4-[3,3-Bis-(4-bromo-phenyl)-allyloxy]-pheny...)
Show SMILES [#6]-[#6]-[#8]-[#6@@H](-[#6]-c1ccc(-[#8]-[#6]\[#6]=[#6](\c2ccc(Br)cc2)-c2ccc(Br)cc2)cc1)-[#6](-[#8])=O
Show InChI InChI=1S/C26H24Br2O4/c1-2-31-25(26(29)30)17-18-3-13-23(14-4-18)32-16-15-24(19-5-9-21(27)10-6-19)20-7-11-22(28)12-8-20/h3-15,25H,2,16-17H2,1H3,(H,29,30)/t25-/m0/s1
NCI pathway
Reactome pathway
n/an/an/an/a 590n/an/an/an/a
Novo Nordisk A/S
Curated by ChEMBL
Assay Description
Activity at human adipose tissue PPAR gamma expressed in HEK293 cells by PPAR-GAL4 transactivation assay
J Med Chem 50: 1495-503 (2007)
Article DOI: 10.1021/jm061202u
BindingDB Entry DOI: 10.7270/Q2J9662B
Peroxisome proliferator-activated receptor alpha
(Homo sapiens (Human))
BDBM50122347
((S)-3-{4-[3,3-Bis-(4-bromo-phenyl)-allyloxy]-pheny...)
Show SMILES [#6]-[#6]-[#8]-[#6@@H](-[#6]-c1ccc(-[#8]-[#6]\[#6]=[#6](\c2ccc(Br)cc2)-c2ccc(Br)cc2)cc1)-[#6](-[#8])=O
Show InChI InChI=1S/C26H24Br2O4/c1-2-31-25(26(29)30)17-18-3-13-23(14-4-18)32-16-15-24(19-5-9-21(27)10-6-19)20-7-11-22(28)12-8-20/h3-15,25H,2,16-17H2,1H3,(H,29,30)/t25-/m0/s1
n/an/an/an/a 300n/an/an/an/a
The University of Tokyo
Curated by ChEMBL
Assay Description
Ability to displace [3H]quipazine binding to 5-hydroxytryptamine 3 receptor sites in NG 108-15.
Bioorg Med Chem Lett 27: 3131-3134 (2017)
Article DOI: 10.1016/j.bmcl.2017.05.037
BindingDB Entry DOI: 10.7270/Q20867QZ
Peroxisome proliferator-activated receptor delta
(Homo sapiens (Human))
BDBM50122347
((S)-3-{4-[3,3-Bis-(4-bromo-phenyl)-allyloxy]-pheny...)
Show SMILES [#6]-[#6]-[#8]-[#6@@H](-[#6]-c1ccc(-[#8]-[#6]\[#6]=[#6](\c2ccc(Br)cc2)-c2ccc(Br)cc2)cc1)-[#6](-[#8])=O
Show InChI InChI=1S/C26H24Br2O4/c1-2-31-25(26(29)30)17-18-3-13-23(14-4-18)32-16-15-24(19-5-9-21(27)10-6-19)20-7-11-22(28)12-8-20/h3-15,25H,2,16-17H2,1H3,(H,29,30)/t25-/m0/s1
n/an/an/an/a 400n/an/an/an/a
The University of Tokyo
Curated by ChEMBL
Assay Description
Ability to displace [3H]quipazine binding to 5-hydroxytryptamine 3 receptor sites in NG 108-15.
Bioorg Med Chem Lett 27: 3131-3134 (2017)
Article DOI: 10.1016/j.bmcl.2017.05.037
BindingDB Entry DOI: 10.7270/Q20867QZ
Peroxisome proliferator-activated receptor gamma
(Homo sapiens (Human))
BDBM50122347
((S)-3-{4-[3,3-Bis-(4-bromo-phenyl)-allyloxy]-pheny...)
Show SMILES [#6]-[#6]-[#8]-[#6@@H](-[#6]-c1ccc(-[#8]-[#6]\[#6]=[#6](\c2ccc(Br)cc2)-c2ccc(Br)cc2)cc1)-[#6](-[#8])=O
Show InChI InChI=1S/C26H24Br2O4/c1-2-31-25(26(29)30)17-18-3-13-23(14-4-18)32-16-15-24(19-5-9-21(27)10-6-19)20-7-11-22(28)12-8-20/h3-15,25H,2,16-17H2,1H3,(H,29,30)/t25-/m0/s1
NCI pathway
Reactome pathway
n/an/an/an/a 900n/an/an/an/a
The University of Tokyo
Curated by ChEMBL
Assay Description
Ability to displace [3H]quipazine binding to 5-hydroxytryptamine 3 receptor sites in NG 108-15.
Bioorg Med Chem Lett 27: 3131-3134 (2017)
Article DOI: 10.1016/j.bmcl.2017.05.037
BindingDB Entry DOI: 10.7270/Q20867QZ
Peroxisome proliferator-activated receptor alpha
(Homo sapiens (Human))
BDBM50122347
((S)-3-{4-[3,3-Bis-(4-bromo-phenyl)-allyloxy]-pheny...)
Show SMILES [#6]-[#6]-[#8]-[#6@@H](-[#6]-c1ccc(-[#8]-[#6]\[#6]=[#6](\c2ccc(Br)cc2)-c2ccc(Br)cc2)cc1)-[#6](-[#8])=O
Show InChI InChI=1S/C26H24Br2O4/c1-2-31-25(26(29)30)17-18-3-13-23(14-4-18)32-16-15-24(19-5-9-21(27)10-6-19)20-7-11-22(28)12-8-20/h3-15,25H,2,16-17H2,1H3,(H,29,30)/t25-/m0/s1
n/an/an/an/a 302n/an/an/an/a
TBA
Assay Description
Transactivation of Homo sapiens (human) PPARalpha assessed as luciferase activity by reporter gene assay
Citation and Details
Article DOI: 10.1007/s00044-011-9818-7
BindingDB Entry DOI: 10.7270/Q2R49TNP
Peroxisome proliferator-activated receptor gamma
(Homo sapiens (Human))
BDBM50122347
((S)-3-{4-[3,3-Bis-(4-bromo-phenyl)-allyloxy]-pheny...)
Show SMILES [#6]-[#6]-[#8]-[#6@@H](-[#6]-c1ccc(-[#8]-[#6]\[#6]=[#6](\c2ccc(Br)cc2)-c2ccc(Br)cc2)cc1)-[#6](-[#8])=O
Show InChI InChI=1S/C26H24Br2O4/c1-2-31-25(26(29)30)17-18-3-13-23(14-4-18)32-16-15-24(19-5-9-21(27)10-6-19)20-7-11-22(28)12-8-20/h3-15,25H,2,16-17H2,1H3,(H,29,30)/t25-/m0/s1
NCI pathway
Reactome pathway
n/an/an/an/a 900n/an/an/an/a
TBA
Assay Description
Transactivation of GAL4-fused Homo sapiens (human) PPARgamma DNA binding domain expressed in African green monkey CV1 cells by luciferase reporter ge...
Citation and Details
Article DOI: 10.1007/s00044-012-0003-4
BindingDB Entry DOI: 10.7270/Q280544F