BDBM50125833 3-(4-Fluoro-benzylidene)-1-hydroxy-5-isobutyl-3H-pyrazine-2,6-dione::CHEMBL16632
SMILES: CC(C)C=c1[nH]c(=Cc2ccc(F)cc2)c(=O)n(O)c1=O
InChI Key: InChIKey=ZYMNGRDVIPWCPS-UHFFFAOYSA-N
Data: 3 IC50
Activity Spreadsheet -- Enzyme Inhibition Constant Data from BindingDB
Found 3 hits for monomerid = 50125833
Trg + Lig
Ki
nM
ΔG°
kcal/mole
IC50
nM
Kd
nM
EC50/IC50
nM
koff
s-1
kon
M-1s-1
pHTemp
°C
PA/PB1
(Hepatitis C virus)
BDBM50125833
(3-(4-Fluoro-benzylidene)-1-hydroxy-5-isobutyl-3H-p...)
Show SMILES CC(C)C=c1[nH]c(=Cc2ccc(F)cc2)c(=O)n(O)c1=O |w:7.7,3.2|
Show InChI InChI=1S/C15H15FN2O3/c1-9(2)7-12-14(19)18(21)15(20)13(17-12)8-10-3-5-11(16)6-4-10/h3-9,17,21H,1-2H3
n/an/a 900n/an/an/an/an/an/a
Roche Discovery Welwyn
Curated by ChEMBL
Assay Description
Inhibitory concentration against cap-dependent endonuclease activity of influenza virus RNP
J Med Chem 46: 1153-64 (2003)
Article DOI: 10.1021/jm020334u
BindingDB Entry DOI: 10.7270/Q22J6B6V
PA/PB1
(Hepatitis C virus)
BDBM50125833
(3-(4-Fluoro-benzylidene)-1-hydroxy-5-isobutyl-3H-p...)
Show SMILES CC(C)C=c1[nH]c(=Cc2ccc(F)cc2)c(=O)n(O)c1=O |w:7.7,3.2|
Show InChI InChI=1S/C15H15FN2O3/c1-9(2)7-12-14(19)18(21)15(20)13(17-12)8-10-3-5-11(16)6-4-10/h3-9,17,21H,1-2H3
n/an/a 900n/an/an/an/an/an/a
Shandong University
Curated by ChEMBL
Assay Description
Inhibition of influenza A virus (A/PR/8/34) N-terminal PA endonuclease using 880 nucleotide ALMV cap1 primer RNA as substrate
J Med Chem 60: 3533-3551 (2017)
Article DOI: 10.1021/acs.jmedchem.6b01227
BindingDB Entry DOI: 10.7270/Q2VQ34XH
PA/PB1
(Hepatitis C virus)
BDBM50125833
(3-(4-Fluoro-benzylidene)-1-hydroxy-5-isobutyl-3H-p...)
Show SMILES CC(C)C=c1[nH]c(=Cc2ccc(F)cc2)c(=O)n(O)c1=O |w:7.7,3.2|
Show InChI InChI=1S/C15H15FN2O3/c1-9(2)7-12-14(19)18(21)15(20)13(17-12)8-10-3-5-11(16)6-4-10/h3-9,17,21H,1-2H3
n/an/a 900n/an/an/an/an/an/a
Merck Research Laboratories
Curated by ChEMBL
Assay Description
Inhibition of cap 1 ALMV primed Influenza transcriptase
J Org Chem 66: 5504-16 (2001)
BindingDB Entry DOI: 10.7270/Q298882D