BDBM50126428 1-Amino-3-[7-(4-dimethylamino-phenyl)-[1,6]naphthyridin-5-ylamino]-propan-2-ol::1-amino-3-(7-(4-(dimethylamino)phenyl)-1,6-naphthyridin-5-ylamino)propan-2-ol::CHEMBL30708
SMILES: CN(C)c1ccc(cc1)-c1cc2ncccc2c(NCC(O)CN)n1
InChI Key: InChIKey=XLZKRUWEKNKABO-UHFFFAOYSA-N
Data: 2 IC50
Activity Spreadsheet -- Enzyme Inhibition Constant Data from BindingDB
Found 2 hits for monomerid = 50126428
Trg + Lig
Ki
nM
ΔG°
kcal/mole
IC50
nM
Kd
nM
EC50/IC50
nM
koff
s-1
kon
M-1s-1
pHTemp
°C
Tyrosine-protein kinase SYK
(Homo sapiens (Human))
BDBM50126428
(1-Amino-3-[7-(4-dimethylamino-phenyl)-[1,6]naphthy...)
Show SMILES CN(C)c1ccc(cc1)-c1cc2ncccc2c(NCC(O)CN)n1
Show InChI InChI=1S/C19H23N5O/c1-24(2)14-7-5-13(6-8-14)17-10-18-16(4-3-9-21-18)19(23-17)22-12-15(25)11-20/h3-10,15,25H,11-12,20H2,1-2H3,(H,22,23)
NCI pathway
Reactome pathway
n/an/a 43n/an/an/an/an/an/a
Sichuan University
Curated by ChEMBL
Assay Description
Inhibition of recombinant Syk (unknown origin)
Bioorg Med Chem Lett 19: 1944-9 (2009)
Article DOI: 10.1016/j.bmcl.2009.02.049
BindingDB Entry DOI: 10.7270/Q2WM1D98
Tyrosine-protein kinase SYK
(Homo sapiens (Human))
BDBM50126428
(1-Amino-3-[7-(4-dimethylamino-phenyl)-[1,6]naphthy...)
Show SMILES CN(C)c1ccc(cc1)-c1cc2ncccc2c(NCC(O)CN)n1
Show InChI InChI=1S/C19H23N5O/c1-24(2)14-7-5-13(6-8-14)17-10-18-16(4-3-9-21-18)19(23-17)22-12-15(25)11-20/h3-10,15,25H,11-12,20H2,1-2H3,(H,22,23)
NCI pathway
Reactome pathway
n/an/a 43n/an/an/an/an/an/a
Boehringer Ingelheim Pharmaceuticals
Curated by ChEMBL
Assay Description
Inhibitory activity against spleen tyrosine kinase (SYK)
Bioorg Med Chem Lett 13: 1415-8 (2003)
BindingDB Entry DOI: 10.7270/Q2MC8ZCJ