BDBM50131841 CHEMBL3633143
SMILES: COc1cc(ccc1Nc1ncc2c(C)cc(=O)n(-c3cccc(NC(=O)C=C)c3)c2n1)N1CCN(C)CC1
InChI Key: InChIKey=VJQPNQROUWVJQN-UHFFFAOYSA-N
Data: 2 IC50
PDB links: 1 PDB ID matches this monomer.
Activity Spreadsheet -- Enzyme Inhibition Constant Data from BindingDB
Found 2 hits for monomerid = 50131841
Trg + Lig
Ki
nM
ΔG°
kcal/mole
IC50
nM
Kd
nM
EC50/IC50
nM
koff
s-1
kon
M-1s-1
pHTemp
°C
Epidermal growth factor receptor
(Homo sapiens (Human))
BDBM50131841
(CHEMBL3633143)
Show SMILES COc1cc(ccc1Nc1ncc2c(C)cc(=O)n(-c3cccc(NC(=O)C=C)c3)c2n1)N1CCN(C)CC1
Show InChI InChI=1S/C29H31N7O3/c1-5-26(37)31-20-7-6-8-22(16-20)36-27(38)15-19(2)23-18-30-29(33-28(23)36)32-24-10-9-21(17-25(24)39-4)35-13-11-34(3)12-14-35/h5-10,15-18H,1,11-14H2,2-4H3,(H,31,37)(H,30,32,33)
n/an/a 330n/an/an/an/an/an/a
Guangzhou Institutes of Biomedicine and Health
Curated by ChEMBL
Assay Description
Inhibition of N-terminal 6His/TEV protease cleavage site-tagged wild type human EGFR using poly (Glu,Tyr) 4:1 as substrate after 1 hr by ELISA
Eur J Med Chem 126: 1107-1117 (2017)
BindingDB Entry DOI: 10.7270/Q2F47RD5
3D
3D Structure (crystal)
Epidermal growth factor receptor
(Homo sapiens (Human))
BDBM50131841
(CHEMBL3633143)
Show SMILES COc1cc(ccc1Nc1ncc2c(C)cc(=O)n(-c3cccc(NC(=O)C=C)c3)c2n1)N1CCN(C)CC1
Show InChI InChI=1S/C29H31N7O3/c1-5-26(37)31-20-7-6-8-22(16-20)36-27(38)15-19(2)23-18-30-29(33-28(23)36)32-24-10-9-21(17-25(24)39-4)35-13-11-34(3)12-14-35/h5-10,15-18H,1,11-14H2,2-4H3,(H,31,37)(H,30,32,33)
n/an/a 386n/an/an/an/an/an/a
Amgen Inc.
Curated by ChEMBL
Assay Description
Binding affinity against delta opioid receptor in mouse hot plate test
ACS Med Chem Lett 6: 987-92 (2015)
BindingDB Entry DOI: 10.7270/Q21C1ZPN
3D
3D Structure (crystal)